{"text_format":"1","workbook":"xlsx","n_sheets":10,"sheets":["Intro","Information","User Guide","Land Rent ","Flexible Land Rent","Further Considerations","Production Costs","Staff Cheat Sheet (HIDE)","Data (HIDE)","Chart Data (HIDE)"],"not_rendered":{"charts":12,"images":4,"macros":1,"external_links":0,"defined_names":94,"comments":2,"pivot_tables":0},"unopened":[],"bounds":{"document_bytes":16777216,"sheet_cells":100000,"rows_first":2000,"rows_last":500,"rows_between":2000,"halvings":0,"cell_chars":16384,"cell_head_chars":4096},"cells_cut":0,"cells_raw":0,"read":"whole","date_system":"1900"}

{"sheet":"Intro","index":0,"n_rows":57,"n_cols":9,"rows_kept":57,"cut":false,"hidden":false,"merged":[[56,1,58,8],[13,0,13,8],[14,0,14,8],[22,1,31,9],[32,1,37,9]]}
[]
[]
[". . . . . . . . . . . . . . . . . . . . . . . . . . . . . . . . . . . . . . . . . . . . . . . . . "]
[]
[]
[]
[]
[]
[]
[]
[]
[]
[null,null,null,null,null,null,null,null,"Version 1.0"]
["Crop Land Rental Rate Calculator"]
[]
{"$rows_left_out":43}
{"sheet":"Information","index":1,"n_rows":75,"n_cols":2,"rows_kept":75,"cut":false,"hidden":false,"merged":[[2,1,2,9],[45,0,52,9],[54,0,62,9],[63,0,63,9],[66,0,72,9],[74,0,81,9],[4,0,8,9],[9,1,10,9],[12,1,13,9],[19,0,20,9],[24,0,33,9],[34,0,42,9],[14,1,14,5]]}
[]
[]
[null,{"$f":"\"RentPlan - General Information \"&Intro!J19","v":"RentPlan - General Information "}]
[]
["What is the fair market rent for farmland in Manitoba? This is a question that both landlords and producers ask quite often. Unfortunately there’s no rent transaction listings for land rental rates in Manitoba, making it difficult to determine what others are paying. However it is important to remember what makes rental agreements successful for both producers and landlords alike. This includes:"]
[]
[]
[]
[]
[null,"•  The landlord and producer should be open and honest with each other, and be able to resolve disagreements cordially. "]
[]
[null,"•  To maximize long term profit, the terms of the lease should be fair to both the landlord and producer. "]
[null,"•  Written agreements help to prevent conflict between the landlord and producer, and force them to think through an equitable and reasonable lease. "]
[]
[null,"Manitoba Agriculture's Contracts and Leases."]
{"$rows_left_out":61}
{"sheet":"User Guide","index":2,"n_rows":62,"n_cols":3,"rows_kept":62,"cut":false,"hidden":false,"merged":[[0,0,0,9],[1,0,3,9],[5,0,5,4],[9,2,10,9],[13,2,15,9],[55,1,56,9],[21,2,22,9],[61,1,63,9],[18,2,19,9],[7,2,8,9],[33,1,34,9],[60,0,60,4],[31,0,31,4],[43,0,43,4],[25,2,26,9],[51,1,52,9],[57,1,58,9],[44,1,46,9],[47,1,48,9],[49,1,50,9],[53,1,54,9]]}
["Rentplan User Guide "]
["Rentplan can be used by both farm producer and landowners in Manitoba to assist in the determination of fair and reasonable crop land rental rates.  Follow the steps below to successfully use RentPlan for your crop land rental rate calculation. "]
[]
[]
[]
["Step #1 - Land Rent Worksheet:"]
[null,"Crop Production, Revenue and Cost Summary:"]
[null,null,"Select Crops - select your crops grown on your farm based on your planned crop rotation during the rental agreement period."]
[]
[null,null,"Acres - enter the total acres for each crop grown on your farm to calculate the weighted average gross revenue and production costs."]
[]
[null,null,"Probable Yield - adjust the default probable yield for each crop selected, based on your farms average yields."]
[null,null,"Price - adjust grain prices to reflect the average net market price for the duration of the crop year."]
[null,null,"Operating Costs Per Acre - to review and change operating costs, click on the link or go to the Production Costs Worksheet. Make any changes required for the crops selected for your farm's actual production costs. Use the dropdown menus to select Crop Insurance and Hail Insurance levels."]
[]
{"$rows_left_out":48}
{"sheet":"Land Rent ","index":3,"n_rows":139,"n_cols":35,"rows_kept":139,"cut":false,"hidden":false,"merged":[[138,0,139,9],[91,0,91,9],[17,0,17,1],[3,0,5,9],[7,0,7,9],[73,0,73,9],[29,0,29,9]]}
[]
[". . . . . . . . . . . . . . . . . . . . . . . . . . . . . . . . . . . . . . . . . . . . . . . . . . . . . . . . . . . "]
["Land Rental Rate Calculation",null,null,null,null,null,null,null,"Printed:",{"$f":"TODAY()","v":"2024-12-06"}]
["Note: Land rental rate analysis is part of long term strategic planning for your farm and caution should be exercised if short term crop yields and prices are utilized. It is generally recommended for land rental rate planning and analysis that a minimum of 3 to 5 year average crop yields and commodity price outlook should be considered.",null,null,null,null,null,null,null,null,null,null,null,null,null,null,null,null,"Manitoba","Risk Area #1","Risk Area #2","Risk Area #3","Risk Area #4","Risk Area #5","Risk Area #6","Risk Area #7","Risk Area #8","Risk Area #9","Risk Area #10","Risk Area #11","Risk Area #12","Risk Area #32","Risk Area #14","Risk Area #15","Risk Area #16"]
[null,null,null,null,null,null,null,null,null,null,null,null,null,null,null,null,"(Select Crop)","Wheat - Hard Red Spring","Wheat - Northern Hard Red","Wheat - Prairie Spring","Wheat - Winter","Oats","Barley","Hybrid Fall Rye","Corn","Canola","Soybeans","Sunflower","Flaxseed","Peas","Beans - Pinto","Beans - White","Beans - Black",{"$f":"'Production Costs'!U5","v":"Other Crop"},{"$f":"'Production Costs'!V5","v":"Other Crop"}]
[]
[]
[{"$f":"Intro!J19&\" Crop Production, Revenue & Cost Summary \"","v":" Crop Production, Revenue & Cost Summary "}]
[{"$f":"IF('Production Costs'!B30=\"Manitoba\",\"\",'Production Costs'!B30)","v":""},null,"Your Farm ","Canola","Wheat - Hard Red Spring","Soybeans","Oats","(Select Crop)","(Select Crop)","(Select Crop)",null,null,null,null,null,null,null,"Canola","Wheat - Hard Red Spring","Soybeans","(Select Crop)","(Select Crop)","(Select Crop)","(Select Crop)"]
[]
["Your Crop Acres",null,{"$f":"SUM(D11:J11)","v":2500},750,750,500,500,0,0,0,null,null,null,null,null,null,null,1000,1000,500,0,0,0,0]
[null,"(Percent of Crop Rotation)",{"$f":"SUM(D12:J12)","v":1},{"$f":"IF(D11=0,\"\",D11/$C$11)","v":0.3},0.3,0.2,0.2,"","",""]
[]
["Probable Yield per Acre (bu or lb.)",null,null,{"$f":"IF($D$9=\"(select crop)\",0,HLOOKUP('Production Costs'!$B$30,'Data (HIDE)'!$A$3:$F$19,VLOOKUP('Land Rent '!$D$9,'Data (HIDE)'!$A$49:$C$65,3,FALSE),FALSE))","v":45},{"$f":"IF($E$9=\"(select crop)\",0,HLOOKUP('Production Costs'!$B$30,'Data (HIDE)'!$A$3:$F$19,VLOOKUP('Land Rent '!$E$9,'Data (HIDE)'!$A$49:$C$65,3,FALSE),FALSE))","v":65},{"$f":"IF($F$9=\"(select crop)\",0,HLOOKUP('Production Costs'!$B$30,'Data (HIDE)'!$A$3:$F$19,VLOOKUP('Land Rent '!$F$9,'Data (HIDE)'!$A$49:$C$65,3,FALSE),FALSE))","v":40},{"$f":"IF($G$9=\"(select crop)\",0,HLOOKUP('Production Costs'!$B$30,'Data (HIDE)'!$A$3:$F$19,VLOOKUP('Land Rent '!$G$9,'Data (HIDE)'!$A$49:$C$65,3,FALSE),FALSE))","v":120},{"$f":"IF($H$9=\"(select crop)\",0,HLOOKUP('Production Costs'!$B$30,'Data (HIDE)'!$A$3:$F$19,VLOOKUP('Land Rent '!$H$9,'Data (HIDE)'!$A$49:$C$65,3,FALSE),FALSE))","v":0},{"$f":"IF($I$9=\"(select crop)\",0,HLOOKUP('Production Costs'!$B$30,'Data (HIDE)'!$A$3:$F$19,VLOOKUP('Land Rent '!$I$9,'Data (HIDE)'!$A$49:$C$65,3,FALSE),FALSE))","v":0},{"$f":"IF($J$9=\"(select crop)\",0,HLOOKUP('Production Costs'!$B$30,'Data (HIDE)'!$A$3:$F$19,VLOOKUP('Land Rent '!$J$9,'Data (HIDE)'!$A$49:$C$65,3,FALSE),FALSE))","v":0},null,null,null,null,null,null,null,{"$f":"IF($D$9=\"(select crop)\",0,HLOOKUP('Production Costs'!$B$30,'Data (HIDE)'!$A$3:$F$19,VLOOKUP('Land Rent '!$D$9,'Data (HIDE)'!$A$49:$C$65,3,FALSE),FALSE))","v":45},{"$f":"IF($E$9=\"(select crop)\",0,HLOOKUP('Production Costs'!$B$30,'Data (HIDE)'!$A$3:$F$19,VLOOKUP('Land Rent '!$E$9,'Data (HIDE)'!$A$49:$C$65,3,FALSE),FALSE))","v":65},{"$f":"IF($F$9=\"(select crop)\",0,HLOOKUP('Production Costs'!$B$30,'Data (HIDE)'!$A$3:$F$19,VLOOKUP('Land Rent '!$F$9,'Data (HIDE)'!$A$49:$C$65,3,FALSE),FALSE))","v":40},{"$f":"IF($G$9=\"(select crop)\",0,HLOOKUP('Production Costs'!$B$30,'Data (HIDE)'!$A$3:$F$19,VLOOKUP('Land Rent '!$G$9,'Data (HIDE)'!$A$49:$C$65,3,FALSE),FALSE))","v":120},{"$f":"IF($H$9=\"(select crop)\",0,HLOOKUP('Production Costs'!$B$30,'Data (HIDE)'!$A$3:$F$19,VLOOKUP('Land Rent '!$H$9,'Data (HIDE)'!$A$49:$C$65,3,FALSE),FALSE))","v":0},{"$f":"IF($I$9=\"(select crop)\",0,HLOOKUP('Production Costs'!$B$30,'Data (HIDE)'!$A$3:$F$19,VLOOKUP('Land Rent '!$I$9,'Data (HIDE)'!$A$49:$C$65,3,FALSE),FALSE))","v":0},{"$f":"IF($J$9=\"(select crop)\",0,HLOOKUP('Production Costs'!$B$30,'Data (HIDE)'!$A$3:$F$19,VLOOKUP('Land Rent '!$J$9,'Data (HIDE)'!$A$49:$C$65,3,FALSE),FALSE))","v":0}]
[]
{"$rows_left_out":125}
{"sheet":"Flexible Land Rent","index":4,"n_rows":124,"n_cols":24,"rows_kept":124,"cut":false,"hidden":false,"merged":[[123,0,124,9],[19,0,19,9],[4,0,4,9],[79,2,79,4],[97,2,97,4],[115,2,115,4],[42,0,42,9],[33,2,35,3],[33,6,35,7],[38,3,40,6]]}
[]
[". . . . . . . . . . . . . . . . . . . . . . . . . . . . . . . . . . . . . . . . . . . . . . . . . . . . . . . . . . . "]
["Flexible Land Rental Calculation ",null,null,null,null,null,null,null,"Printed:",{"$f":"TODAY()","v":"2024-12-06"}]
[null,null,null,null,null,null,null,null,null,null,null,null,null,null,null,null,null,{"$f":"'Land Rent '!D9","v":"Canola"},{"$f":"'Land Rent '!E9","v":"Wheat - Hard Red Spring"},{"$f":"'Land Rent '!F9","v":"Soybeans"},{"$f":"'Land Rent '!G9","v":"Oats"},{"$f":"'Land Rent '!H9","v":"(Select Crop)"},{"$f":"'Land Rent '!I9","v":"(Select Crop)"},{"$f":"'Land Rent '!J9","v":"(Select Crop)"}]
["Minimum & Maximum Rental Rate Calculation"]
[]
["Step #1",null,null,null,"Current Year Crop to be Grown ","Wheat - Hard Red Spring"]
["Step #2"]
[null,null,null,{"$f":"\"Probable \"&F7&\" Yield per Acre\"","v":"Probable Wheat - Hard Red Spring Yield per Acre"},{"$f":"IF($F$7=\"(select crop)\",0,HLOOKUP('Production Costs'!$B$30,'Data (HIDE)'!$A$3:$F$19,VLOOKUP($F$7,'Data (HIDE)'!$A$49:$C$65,3,FALSE),FALSE))","v":65},"(bu or lb.)",null,null,null,null,null,null,null,null,null,null,null,null,{"$f":"IF($F$7=\"(select crop)\",0,HLOOKUP('Production Costs'!$B$30,'Data (HIDE)'!$A$3:$F$19,VLOOKUP($F$7,'Data (HIDE)'!$A$49:$C$65,3,FALSE),FALSE))","v":65}]
[null,null,null,{"$f":"\"Probable \"&F7&\" Price per Unit\"","v":"Probable Wheat - Hard Red Spring Price per Unit"},{"$f":"IF($F$7=\"(select crop)\",0,VLOOKUP($F$7,'Data (HIDE)'!$A$49:$C$65,2,FALSE))","v":8},"(bu or lb.)",null,null,null,null,null,null,null,null,null,null,null,null,{"$f":"IF($F$7=\"(select crop)\",0,VLOOKUP($F$7,'Data (HIDE)'!$A$49:$C$65,2,FALSE))","v":8}]
[]
["Step #3",null,null,"Land Rental Rate",{"$f":"('Land Rent '!$G$43+'Land Rent '!$I$43)/2","v":69.5},"/acre",null,null,null,null,null,null,null,null,null,null,null,null,{"$f":"('Land Rent '!$G$43+'Land Rent '!$I$43)/2","v":69.5},"/acre"]
[]
[]
["Step #4"]
{"$rows_left_out":110}
{"sheet":"Further Considerations","index":5,"n_rows":81,"n_cols":11,"rows_kept":81,"cut":false,"hidden":false,"merged":[[78,0,79,9],[7,1,8,9],[10,1,11,9],[15,1,16,9],[67,2,67,4],[36,7,36,8]]}
[]
[". . . . . . . . . . . . . . . . . . . . . . . . . . . . . . . . . . . . . . . . . . . . . . . . . . . . . . . . . . . "]
[null,null,null,null,null,null,null,null,"Printed:",{"$f":"TODAY()","v":"2024-12-06"}]
["Crop Land Rental Rate - Further Analysis"]
[]
["#1 - Land Rental Breakeven Calculations"]
[]
[null,{"$f":"\"Maximum Land Rental Payable (with $\"&'Land Rent '!G40&\" to $\"&'Land Rent '!I40&\"/acre producer profit) is calculated at $\"&'Land Rent '!G43&\" to $\"&'Land Rent '!I43&\" per acre (\"&ROUND('Chart Data (HIDE)'!F43,2)*100&\" to \"&ROUND('Chart Data (HIDE)'!G43,2)*100&\"% of margin over operating costs or \"&ROUND('Chart Data (HIDE)'!F30,2)*100&\" to \"&ROUND('Chart Data (HIDE)'!G30,2)*100&\"% of gross revenue).\"","v":"Maximum Land Rental Payable (with $5 to $20/acre producer profit) is calculated at $62 to $77 per acre (32 to 39% of margin over operating costs or 12 to 15% of gross revenue)."}]
[]
[]
[null,{"$f":"\"Maximum Breakeven Land Rental (before profit) is calculated at $\"&TEXT('Land Rent '!H37,\"#.##\")&\" per acre (\"&ROUND('Land Rent '!G72,2)*100&\"% of margin over operating costs or \"&ROUND('Land Rent '!G71,2)*100&\"% share of gross revenue).\"","v":"Maximum Breakeven Land Rental (before profit) is calculated at $82.38 per acre (42% of margin over operating costs or 16% share of gross revenue)."}]
[]
[]
["#2 - Flexible Land Rental Breakeven Calculation"]
[]
{"$rows_left_out":67}
{"sheet":"Production Costs","index":6,"n_rows":51,"n_cols":43,"rows_kept":51,"cut":false,"hidden":false,"merged":[]}
[null,null,null,null,null,null,null,null,null,null,null,null,null,null,null,null,null,null,null,null,null,null,null,null,null,"HIDE"]
[]
[{"$f":"IF(B30=\"Manitoba\",\"Crop Production Costs \"&Intro!J19&\" Guidelines - Manitoba (Dollars Per Acre)\",\"Crop Production Costs \"&Intro!J19&\" Guidelines - \"&B30&\" (Dollars Per Acre)\")","v":"Crop Production Costs  Guidelines - Manitoba (Dollars Per Acre)"}]
[]
[null,null,"Wheat - Hard Red Spring","Wheat - Northern Hard Red","Wheat - Prairie Spring","Wheat - Winter","Oats","Barley","Hybrid Fall Rye","Corn",null,null,"Canola","Soybeans","Sunflower","Flaxseed","Peas","Beans - Pinto","Beans - White","Beans - Black","Other Crop","Other Crop",null,null,null,"REDO MACRO"]
["A.  Operating Costs",null,null,null,null,null,null,null,null,null,null,null,null,null,null,null,null,null,null,null,null,null,null,null,null,1,{"$f":"Z6+1","v":2},{"$f":"AA6+1","v":3},4,5,6,7,8,9,10,11,12,13,14,15,16]
[null,"Seed & Treatment",34,34,34,32,25,20,78.400000000000006,100,null,"Seed & Treatment",82.5,90,50,56,85,105,110,115,0,0,null,null,null,36,36,36,34,25,24,82.4,102,null,"Seed & Treatment",80,90,50,64,88,116,112,118]
[null,"Fertilizer",113.06977594519662,122.985296265237,116.37494938521009,113.06977594519662,87.783700968189933,84.733791097549911,136.20599002529079,173.17645237710656,null,"Fertilizer",128.36473109809572,44.010542060074854,104.3190181062656,58.566567022832523,29.832727374231503,71.787260782886335,78.397607662913231,78.397607662913231,0,0,null,null,null,124.43675035512648,136.28549950962261,128.3863334066252,124.43675035512648,91.207482731609261,93.082905950694425,152.08383171561741,176.99969386610155,null,"Fertilizer",142.09682306549493,42.233953714494398,116.13560632890359,62.464868801306572,28.131738532718302,78.26320100730139,86.162367110298788,86.162367110298788]
[null,"Crop Protection",55.25,55.25,55.25,36,24.5,27.5,8.5,44,null,"Crop Protection",58.5,21.75,49,33.5,42.75,128.5,128.5,128.5,0,0,null,null,null,61.81,61.81,61.81,41.54,23.130000000000003,50.129999999999995,8.3800000000000008,32,null,"Crop Protection",66.760000000000005,23.58,47.52,32.26,46,129.78,129.78,129.78]
[null,"Fuel",29.969784842105263,30.506691368421055,30.506691368421055,29.969784842105263,35.875756631578945,33.01050442105263,30.480504421052633,40.333382736842111,null,"Fuel",29.802158736842106,26.185252210526318,30.700504421052635,28.534532631578948,26.585971789473689,25.620408000000005,25.262470315789482,25.262470315789482,0,0,null,null,null,38.143362526315784,38.826698105263155,38.280029642105255,38.143362526315784,44.976718315789476,41.740035031578948,38.793369263157892,46.59006063157895,null,"Fuel",37.930020210526308,33.053350399999999,39.073369263157893,36.316677894736834,33.153355789473686,32.607792000000003,32.152234947368427,32.152234947368427]
[null,"Machinery Operating & Lease",25,25,25,25,25,25,25,25,null,"Machinery Operating & Lease",25,25,38,25,25,50,50,50,0,0,null,null,null,25,25,25,25,25,25,25,25,null,"Machinery Operating & Lease",25,25,38,25,25,50,50,50]
[null,"Labour - Hired",5.4,5.4,5.4,5.4,5.4,5.4,5.4,5.4,null,"Labour - Hired",5.4,5.4,5.4,5.4,5.4,5.4,5.4,5.4,0,0,null,null,null,5.4,5.4,5.4,5.4,5.4,5.4,5.4,5.4,null,"Labour - Hired",5.4,5.4,5.4,5.4,5.4,5.4,5.4,5.4]
[null,"Crop Insurance",10.265000000000001,12.772500000000001,10.32,10.247500000000002,18.2425,14.350000000000001,14.865000000000002,40.094999999999999,null,"Crop Insurance",13.96,21.772499999999997,16.844999999999999,13.990000000000002,15.387500000000001,38.444999999999993,36.747500000000002,47.162500000000001,0,0,null,null,null,13.5175,16.407499999999999,12.445,13.977499999999999,21.015000000000001,18.954999999999998,18.497499999999999,50.695000000000007,null,"Crop Insurance",17.495000000000001,25.945,27.3475,21.695,19.657499999999999,39.0075,40.815000000000005,46.855000000000004]
[null,"Hail Insurance",10.8,10.8,10.8,10.8,10.8,10.8,10.8,10.8,null,"Hail Insurance",10.8,14.040000000000001,10.8,10.8,21.6,18.900000000000002,18.900000000000002,18.900000000000002,0,0,null,null,null,11.8,11.8,11.8,11.8,11.8,11.8,11.8,11.8,null,"Hail Insurance",11.8,15.34,11.8,11.8,23.6,20.65,20.65,20.65]
[null,"Drying & Other Costs",17.75,17.75,17.75,17.75,17.75,17.75,17.75,87.75,null,"Drying  & Other Costs",17.75,17.75,27.75,17.75,17.75,17.75,17.75,17.75,0,0,null,null,null,17.75,17.75,17.75,17.75,17.75,17.75,17.75,87.75,null,"Drying  & Other Costs",17.75,17.75,27.75,17.75,17.75,17.75,17.75,17.75]
{"$rows_left_out":37}
{"sheet":"Staff Cheat Sheet (HIDE)","index":7,"n_rows":43,"n_cols":11,"rows_kept":43,"cut":false,"hidden":true,"merged":[[1,0,1,2],[16,0,16,2],[5,0,5,2],[8,0,8,2],[10,0,10,2],[14,0,14,2],[16,4,16,6],[1,8,1,10],[5,8,5,10],[8,8,8,10],[10,8,10,10],[14,8,14,10],[16,8,16,10],[1,4,1,6],[5,4,5,6],[8,4,8,6],[10,4,10,6],[14,4,14,6],[38,0,38,2],[23,4,23,6],[27,4,27,6],[30,4,30,6],[32,4,32,6],[36,4,36,6],[38,4,38,6],[23,0,23,2],[27,0,27,2],[30,0,30,2],[32,0,32,2],[36,0,36,2],[38,8,38,10],[23,8,23,10],[27,8,27,10],[30,8,30,10],[32,8,32,10],[36,8,36,10]]}
[]
[{"$f":"\"$\"&ROUND((((A3*C3)+(C4*A4)+(A5*C5))/3),0)&\" Gross Revenue\"","v":"$255 Gross Revenue"},null,null,null,{"$f":"\"$\"&ROUND((((E3*G3)+(G4*E4)+(E5*G5))/3),0)&\" Gross Revenue\"","v":"$301 Gross Revenue"},null,null,null,{"$f":"\"$\"&ROUND((((I3*K3)+(K4*I4)+(I5*K5))/3),0)&\" Gross Revenue\"","v":"$342 Gross Revenue"}]
[30,"canola",{"$f":"'Data (HIDE)'!$B$50","v":8},null,35,"canola",{"$f":"'Data (HIDE)'!$B$50","v":8},null,40,"canola",{"$f":"'Data (HIDE)'!$B$50","v":8}]
[30,"soybeans",{"$f":"'Data (HIDE)'!$B$51","v":7.5},null,35,"soybeans",{"$f":"'Data (HIDE)'!$B$51","v":7.5},null,39,"soybeans",{"$f":"'Data (HIDE)'!$B$51","v":7.5}]
[40,"rs wheat",{"$f":"'Data (HIDE)'!$B$52","v":7.5},null,48,"rs wheat",{"$f":"'Data (HIDE)'!$B$52","v":7.5},null,55,"rs wheat",{"$f":"'Data (HIDE)'!$B$52","v":7.5}]
["Gross Revenue Share",null,null,null,"Gross Revenue Share",null,null,null,"Gross Revenue Share"]
[null,"Avg.",null,null,null,"Avg.",null,null,null,"Avg."]
[0.15,{"$f":"AVERAGE(A8,C8)","v":0.16999999999999998},0.19,null,{"$f":"$A$8","v":0.15},{"$f":"AVERAGE(E8,G8)","v":0.16999999999999998},{"$f":"$C$8","v":0.19},null,{"$f":"$A$8","v":0.15},{"$f":"AVERAGE(I8,K8)","v":0.16999999999999998},{"$f":"$C$8","v":0.19}]
["Fair Mkt Land Rent",null,null,null,"Fair Mkt Land Rent",null,null,null,"Fair Mkt Land Rent"]
[{"$f":"ROUND(((((A3*C3)+(C4*A4)+(A5*C5))/3)*A8),0)","v":38},{"$f":"ROUND(((((A3*C3)+(C4*A4)+(A5*C5))/3)*B8),0)","v":43},{"$f":"ROUND(((((A3*C3)+(C4*A4)+(A5*C5))/3)*C8),0)","v":48},null,{"$f":"ROUND(((((E3*G3)+(G4*E4)+(E5*G5))/3)*E8),0)","v":45},{"$f":"ROUND(((((E3*G3)+(G4*E4)+(E5*G5))/3)*F8),0)","v":51},{"$f":"ROUND(((((E3*G3)+(G4*E4)+(E5*G5))/3)*G8),0)","v":57},null,{"$f":"ROUND(((((I3*K3)+(K4*I4)+(I5*K5))/3)*I8),0)","v":51},{"$f":"ROUND(((((I3*K3)+(K4*I4)+(I5*K5))/3)*J8),0)","v":58},{"$f":"ROUND(((((I3*K3)+(K4*I4)+(I5*K5))/3)*K8),0)","v":65}]
["Investment Rate of Return",null,null,null,"Investment Rate of Return",null,null,null,"Investment Rate of Return"]
[null,"Avg.",null,null,null,"Avg.",null,null,null,"Avg."]
[{"$f":"'Land Rent '!$G$76/100","v":0.02},{"$f":"AVERAGE($A$13,$C$13)","v":2.2499999999999999E-2},{"$f":"'Land Rent '!$I$76/100","v":2.5000000000000001E-2},null,{"$f":"'Land Rent '!$G$76/100","v":0.02},{"$f":"AVERAGE($A$13,$C$13)","v":2.2499999999999999E-2},{"$f":"'Land Rent '!$I$76/100","v":2.5000000000000001E-2},null,{"$f":"'Land Rent '!$G$76/100","v":0.02},{"$f":"AVERAGE($A$13,$C$13)","v":2.2499999999999999E-2},{"$f":"'Land Rent '!$I$76/100","v":2.5000000000000001E-2}]
[{"$f":"'Land Rent '!$H$77","v":0},"Taxes",null,null,{"$f":"'Land Rent '!$H$77","v":0},"Taxes",null,null,{"$f":"'Land Rent '!$H$77","v":0},"Taxes"]
["Land Value",null,null,null,"Land Value",null,null,null,"Land Value"]
{"$rows_left_out":29}
{"sheet":"Data (HIDE)","index":8,"n_rows":107,"n_cols":22,"rows_kept":107,"cut":false,"hidden":true,"merged":[[1,13,1,14]]}
[null,null,null,null,null,null,null,null,null,null,null,null,null,null,null,null,"MPP"]
["2024 MASC DATA","RENTPLAN",null,null,null,null,null,null,2024,null,2023,2024,2025,"Manitoba MPP",null,null,"2,5,6,12"]
["Expected Yield/Acre 'D'","Manitoba","Risk Area #2","Risk Area #5","Risk Area #6","Risk Area #12","Avg.",null,"Rentplan yields",null,"COP Yields","COP Yields","COP Yields","2019-23\n5 year","2014-23\n10 year","Median 5&10","2019-23\n5 year",null,0.9,0.95,null,"https://www.masc.mb.ca/masc.nsf/mmpp_browser_variety.html"]
["Wheat - Hard Red Spring",65,62.1,69.400000000000006,61.6,69.400000000000006,{"$f":"AVERAGE(C4:F4)","v":65.625},null,60,null,64,65,65,59.4,58.1,{"$f":"AVERAGE(N4:O4)","v":58.75},61.3,null,{"$f":"ROUND(M4*$S$3,0)","v":59},{"$f":"ROUND(M4*$T$3,0)","v":62}]
["Wheat - Northern Hard Red",70,68.099999999999994,76,67.5,76,{"$f":"AVERAGE(C5:F5)","v":71.900000000000006},null,67,null,70,70,70,66,"NA",{"$f":"AVERAGE(N5:O5)","v":66},69.2,null,{"$f":"ROUND(M5*$S$3,0)","v":63},{"$f":"ROUND(M5*$T$3,0)","v":67}]
["Wheat - Prairie Spring",70,62.8,70.2,62.3,70.2,66.375,null,65,null,70,66,70,63.7,66.3,65,66.099999999999994,null,63,67]
["Wheat - Winter",65,60,67,59.5,67,63.375,null,60,null,66,65,65,55.4,59.4,57.4,65.3,null,59,62]
["Oats",120,113.6,129,99.3,136.4,119.57499999999999,null,105,null,120,115,120,102.3,104.5,103.4,110.2,null,108,114]
["Barley",80,78.099999999999994,84.6,73.599999999999994,82.6,79.724999999999994,null,74,null,78,78,80,74.2,73.599999999999994,73.900000000000006,79.099999999999994,null,72,76]
["Hybrid Fall Rye",80,77.599999999999994,77.599999999999994,77.599999999999994,77.599999999999994,77.599999999999994,null,71,null,80,80,80,70.8,70.8,70.8,80.599999999999994,null,72,76]
["Corn",140,116.4,135.6,103,156.19999999999999,127.8,null,130,null,135,135,140,126.4,128.30000000000001,127.35000000000001,136,null,126,133]
["Canola",45,43.6,47.2,43.9,49.2,45.975000000000009,null,42,null,44,45,45,40.700000000000003,40.700000000000003,40.700000000000003,41.5,null,41,43]
["Soybeans",40,35.6,35.6,35.6,39.200000000000003,36.5,null,35,null,36,38,40,34.1,35,34.549999999999997,35,null,36,38]
["Sunflower - oilseed",2000,2017,2017,2017,2017,2017,null,1900,null,2000,2000,2000,1967,1745,1856,2039,null,1800,1900]
["Flaxseed",25,23,28.2,23.1,27.4,25.425000000000004,null,24,null,25,25,25,23.5,23.2,23.35,24.8,null,23,24]
{"$rows_left_out":93}
{"sheet":"Chart Data (HIDE)","index":9,"n_rows":46,"n_cols":11,"rows_kept":46,"cut":false,"hidden":true,"merged":[]}
[]
[]
[null,"Producer - Total Cost (Risk) vs. Return on Investment (Reward) Analysis"]
[null,"Landowner - Return on Assest (ROA) Analysis",null,null,null,null,"Landowner Rent $/Ac (Reward)","Producer Profit $/Ac (Reward)"]
[null,null,"Operating Costs","Labour / Owner Salary Costs","Equipment Costs","Storage Costs","Land Rent $/Ac","Producer Profit Margin $/Ac","Producer Return on Investment or ROI (Reward)","Landowner Return on Asset (ROA)","Total Costs $/Ac (Risk)"]
[1,"Production Cost Rent (Low Range)",{"$f":"'Land Rent '!H34","v":333.30126668160813},{"$f":"'Land Rent '!H35","v":27},{"$f":"'Land Rent '!H36","v":86.593837104101425},null,{"$f":"'Land Rent '!G43","v":62},{"$f":"'Land Rent '!I40","v":20},{"$f":"'Land Rent '!I69","v":4.0047341903435091E-2},{"$f":"'Land Rent '!G65","v":1.3777777777777778E-2},{"$f":"SUM(C6:G6)","v":508.89510378570958}]
[2,"Production Cost Rent (High Range)",{"$f":"'Land Rent '!H34","v":333.30126668160813},{"$f":"'Land Rent '!H35","v":27},{"$f":"'Land Rent '!H36","v":86.593837104101425},null,{"$f":"'Land Rent '!I43","v":77},{"$f":"'Land Rent '!G40","v":5},{"$f":"'Land Rent '!G69","v":1.0269033200376984E-2},{"$f":"'Land Rent '!I65","v":1.7111111111111112E-2},{"$f":"SUM(C7:G7)","v":523.89510378570958}]
[4,"Land Value Rent (Low Range)",{"$f":"'Land Rent '!G83","v":333.30126668160813},{"$f":"'Land Rent '!G84","v":27},{"$f":"'Land Rent '!G85","v":86.593837104101425},null,{"$f":"'Land Rent '!G87","v":90},{"$f":"'Land Rent '!G88","v":-8},{"$f":"'Land Rent '!G90","v":-1.4192909810462728E-2},{"$f":"'Land Rent '!G91","v":0.02},{"$f":"SUM(C8:G8)","v":536.89510378570958}]
[null,"Land Value Rent (High Range)",{"$f":"'Land Rent '!G83","v":333.30126668160813},{"$f":"'Land Rent '!G84","v":27},{"$f":"'Land Rent '!G85","v":86.593837104101425},null,{"$f":"'Land Rent '!H87","v":113},{"$f":"'Land Rent '!H88","v":-31},{"$f":"'Land Rent '!H90","v":-5.4689000812246667E-2},{"$f":"'Land Rent '!H91","v":2.5111111111111112E-2},{"$f":"SUM(C9:G9)","v":559.89510378570958}]
[3,"Maximum Breakeven Land Rent",{"$f":"'Land Rent '!H34","v":333.30126668160813},{"$f":"'Land Rent '!H35","v":27},{"$f":"'Land Rent '!H36","v":86.593837104101425},null,{"$f":"'Land Rent '!H37","v":82.379896214290426},0,{"$f":"'Land Rent '!L69","v":0},{"$f":"SUM(('Land Rent '!H37-'Land Rent '!H77)/('Land Rent '!H75))","v":1.8306643603175649E-2},{"$f":"SUM(C10:G10)","v":529.27499999999998}]
[]
[null,"Land Rent - Summary"]
[null,"Producer - Profit Margin Summary"]
[]
[]
{"$rows_left_out":31}