{"text_format":"1","workbook":"xlsx","n_sheets":6,"sheets":["Seed Calculator","Small Grains","Speciality Crop","DATA (hide)","names (hide)","Seeding Rates DV (hide)"],"not_rendered":{"charts":0,"images":2,"macros":1,"external_links":0,"defined_names":7,"comments":4,"pivot_tables":0},"unopened":[],"bounds":{"document_bytes":16777216,"sheet_cells":100000,"rows_first":2000,"rows_last":500,"rows_between":2000,"halvings":0,"cell_chars":16384,"cell_head_chars":4096},"cells_cut":0,"cells_raw":0,"read":"whole","date_system":"1900"}

{"sheet":"Seed Calculator","index":0,"n_rows":56,"n_cols":37,"rows_kept":56,"cut":false,"hidden":true,"merged":[[2,14,2,15],[5,2,5,4],[5,8,5,10],[5,11,5,12],[5,14,5,15],[49,0,50,15],[5,23,5,25],[5,29,5,31],[5,32,5,33],[5,35,5,36]]}
[]
[". . . . . . . . . . . . . . . . . . . . . . . . . . . . . . . . . . . . . . . . . . . . . . . . . . . . . . . . . . . . . ."]
["MERFELD - Seeding Rate & Seed Cost Calculator",null,null,null,null,null,null,null,null,null,null,null,"Printed:",null,{"$f":"TODAY()","v":"2025-05-13"}]
[null,null,null,null,null,"*** Enter changes to BLUE values only ***",null,null,null,null,null,null,null,null,null,"Version 1.0"]
[]
[null,null,"Seed and Treatment",null,null,"Seed","Seeding","Seeding","Target Plant Stand Population",null,null,"1,000 Kernal Weight",null,"Seed","Seed Survival",null,null,null,null,null,null,null,null,"Seed and Treatment",null,null,"Seed","Seeding","Seeding","Target Plant Stand Population",null,null,"1,000 Kernal Weight",null,"Seed","Seed Survival"]
[null,null,"Price",null,"Number","Cost","Rate","Rate","Plants","Range/ft.2","Plants","Actual","Range","Germination","Expected","Range",null,null,null,null,null,null,null,"Price",null,"Pounds","Cost","Rate","Rate","Optimal","Range/ft.2","Optimal","Actual","Range","Germination","Expected","Range"]
[null,"Crop","per Unit","unit","per unit","($/acre)","(lb./acre)","(units/ac)","per ft.2","low - high","per m2","(grams)","(grams)","%","%","%",null,null,null,null,null,null,"Crop","per Unit","unit","per unit","($/acre)","(lb./acre)","(units/ac)","per ft.2","low - high","per m2","(grams)","(grams)","%","%","%"]
[]
["#1","Canola",{"$f":"VLOOKUP(B10,'DATA (hide)'!$A$4:$Y$30,2,FALSE)","v":825},{"$f":"VLOOKUP(B10,'DATA (hide)'!$A$4:$Y$30,3,FALSE)","v":"Bag"},{"$f":"VLOOKUP(B10,'DATA (hide)'!$A$4:$Y$30,4,FALSE)","v":50},{"$f":"G10*(C10/E10)","v":82.5},{"$f":"IF(L10=0,0,ROUND(((I10*L10)/(N10*O10))/10.4,1))","v":5},{"$f":"SUM(G10/E10)","v":0.1},{"$f":"VLOOKUP(B10,'DATA (hide)'!$A$4:$Y$30,10,FALSE)","v":7.5},{"$f":"VLOOKUP(B10,'DATA (hide)'!$A$4:$Y$30,8,FALSE)&\"-\"&VLOOKUP(B10,'DATA (hide)'!$A$4:$Y$30,9,FALSE)","v":"3-12"},{"$f":"ROUND(I10*10.7639,0)","v":81},{"$f":"VLOOKUP(B10,'DATA (hide)'!$A$4:$Y$30,14,FALSE)","v":4.95},{"$f":"VLOOKUP(B10,'DATA (hide)'!$A$4:$Y$30,12,FALSE)&\"-\"&VLOOKUP(B10,'DATA (hide)'!$A$4:$Y$30,13,FALSE)","v":"3-7"},{"$f":"VLOOKUP(B10,'DATA (hide)'!$A$4:$Y$30,15,FALSE)","v":0.95},{"$f":"VLOOKUP(B10,'DATA (hide)'!$A$4:$Y$30,18,FALSE)","v":0.75},{"$f":"VLOOKUP(B10,'DATA (hide)'!$A$4:$Y$30,16,FALSE)&\"-\"&VLOOKUP(B10,'DATA (hide)'!$A$4:$Y$30,17,FALSE)","v":"40-80"},null,null,null,null,null,"#1","(Select Crop)",{"$f":"VLOOKUP(W10,'DATA (hide)'!$A$4:$Y$30,2,FALSE)","v":0},{"$f":"VLOOKUP(W10,'DATA (hide)'!$A$4:$Y$30,3,FALSE)","v":"Bu"},{"$f":"VLOOKUP(W10,'DATA (hide)'!$A$4:$Y$30,4,FALSE)","v":1},{"$f":"AB10*(X10/Z10)","v":0},{"$f":"IF(AG10=0,0,ROUND(((AD10*AG10)/(AI10*AJ10))/10.4,1))","v":0},{"$f":"SUM(AB10/Z10)","v":0},{"$f":"VLOOKUP(W10,'DATA (hide)'!$A$4:$Y$30,10,FALSE)","v":0},{"$f":"VLOOKUP(W10,'DATA (hide)'!$A$4:$Y$30,8,FALSE)&\"-\"&VLOOKUP(W10,'DATA (hide)'!$A$4:$Y$30,9,FALSE)","v":"0-0"},{"$f":"ROUND(AD10*10.7639,0)","v":0},{"$f":"VLOOKUP(W10,'DATA (hide)'!$A$4:$Y$30,14,FALSE)","v":0},{"$f":"VLOOKUP(W10,'DATA (hide)'!$A$4:$Y$30,12,FALSE)&\"-\"&VLOOKUP(W10,'DATA (hide)'!$A$4:$Y$30,13,FALSE)","v":"0-0"},{"$f":"VLOOKUP(W10,'DATA (hide)'!$A$4:$Y$30,15,FALSE)","v":0},{"$f":"VLOOKUP(W10,'DATA (hide)'!$A$4:$Y$30,18,FALSE)","v":0},{"$f":"VLOOKUP(W10,'DATA (hide)'!$A$4:$Y$30,16,FALSE)&\"-\"&VLOOKUP(W10,'DATA (hide)'!$A$4:$Y$30,17,FALSE)","v":"0-0"}]
[]
[null,"bigyield","Acres",160,null,"Row Spacing (inches)",null,null,null,"Seed per 100ft. Row (grams)",{"$f":"ROUND((G10*F13)/11.5,1)","v":4.3},null,"Seeds per acre",{"$f":"IF(I10=0,0,(I10*43560)/(N10*O10))","v":458526.31578947377},null,null,null,null,null,null,null,null,"(enter variety)","Acres",0,null,"Row Spacing (inches)",null,null,null,"Seed per 100ft. Row (grams)",{"$f":"ROUND((AB10*AA13)/11.5,1)","v":0},null,"Seeds per acre",{"$f":"IF(AD10=0,0,(AD10*43560)/(AI10*AJ10))","v":0}]
[null,null,"Total Cost",{"$f":"SUM(D12*F10)","v":13200},null,10,null,null,null,"Seeds per ft. row",{"$f":"IF(L10=0,0,ROUND(((K12/100)*1000)/L10,1))","v":8.6999999999999993},null,"Seeds per pound",{"$f":"IF(L10=0,0,ROUND((1000*453.592)/L10,0))","v":91635},null,null,null,null,null,null,null,null,null,"Total Cost",{"$f":"SUM(Y12*AA10)","v":0},null,10,null,null,null,"Seeds per ft. row",{"$f":"IF(AG10=0,0,ROUND(((AF12/100)*1000)/AG10,1))","v":0},null,"Seeds per pound",{"$f":"IF(AG10=0,0,ROUND((1000*453.592)/AG10,0))","v":0}]
[]
[]
{"$rows_left_out":42}
{"sheet":"Small Grains","index":1,"n_rows":28,"n_cols":28,"rows_kept":28,"cut":false,"hidden":false,"merged":[[6,25,6,26],[11,6,12,7],[25,0,26,11],[6,13,6,14],[6,9,6,10],[18,2,18,10],[11,3,12,4]]}
[]
[". . . . . . . . . . . . . . . . . . . . . . . . . . . . . . . . . . . . . . . . . . . . . . . . . . . . . . . . . . . . . . . ."]
["Small Grains - Seeding Rate & Cost Calculator",null,null,null,null,null,null,null,null,null,"Printed:",{"$f":"TODAY()","v":"2025-05-13"}]
[]
[null,null,null,"*** Enter changes to BLUE values only ***",null,null,null,null,null,null,null,"Version 1.0"]
[]
[null,null,null,null,null,null,"Seed","1,000 Seed","Seed Survival1","Target Plant Stand Population",null,"Row "]
[null,"Wheat - Hard Red Spring",null,"Price",null,"Pounds","Germ","Wt. (grams)","Expected %","Plants/ft.2","Plants/m2","Spacing",null,null,null,null,null,"(Select Crop)"]
[null,null,"Acres",{"$f":"\"per \"&E10","v":"per Bu"},"unit",{"$f":"\"per \"&E10","v":"per Bu"},"%",{"$f":"\"(Range \"&VLOOKUP(B8,'DATA (hide)'!$A$4:$Y$30,12,FALSE)&\"-\"&VLOOKUP(B8,'DATA (hide)'!$A$4:$Y$30,13,FALSE)&\")\"","v":"(Range 31-38)"},{"$f":"\"(Range \"&VLOOKUP(B8,'DATA (hide)'!$A$4:$Y$30,16,FALSE)&\"-\"&VLOOKUP(B8,'DATA (hide)'!$A$4:$Y$30,17,FALSE)&\"%)\"","v":"(Range 85-90%)"},{"$f":"\"(Range \"&VLOOKUP(B8,'DATA (hide)'!$A$4:$Y$30,8,FALSE)&\"-\"&VLOOKUP(B8,'DATA (hide)'!$A$4:$Y$30,9,FALSE)&\")\"","v":"(Range 23-28)"},{"$f":"\"(Range \"&ROUND(VLOOKUP(B8,'DATA (hide)'!$A$4:$Y$30,8,FALSE)*10.7639,0)&\"-\"&ROUND(VLOOKUP(B8,'DATA (hide)'!$A$4:$Y$30,9,FALSE)*10.7639,0)&\")\"","v":"(Range 248-301)"},"(inches)"]
[null,"Enter Variety Name Here",160,{"$f":"VLOOKUP(B8,'DATA (hide)'!$A$4:$Y$30,2,FALSE)","v":17},{"$f":"VLOOKUP(B8,'DATA (hide)'!$A$4:$Y$30,3,FALSE)","v":"Bu"},{"$f":"VLOOKUP(B8,'DATA (hide)'!$A$4:$Y$30,4,FALSE)","v":60},{"$f":"VLOOKUP(B8,'DATA (hide)'!$A$4:$Y$30,15,FALSE)","v":0.95},{"$f":"VLOOKUP(B8,'DATA (hide)'!$A$4:$Y$30,14,FALSE)","v":36},{"$f":"VLOOKUP(B8,'DATA (hide)'!$A$4:$Y$30,18,FALSE)","v":0.85},{"$f":"VLOOKUP(B8,'DATA (hide)'!$A$4:$Y$30,10,FALSE)","v":28},{"$f":"ROUND(J10*10.7639,0)","v":301},{"$f":"VLOOKUP(B8,'DATA (hide)'!$A$4:$Y$30,19,FALSE)","v":10},null,null,null,null,null,"Enter Variety Name Here",0,{"$f":"VLOOKUP(R8,'DATA (hide)'!$A$4:$Y$30,2,FALSE)","v":0},{"$f":"VLOOKUP(R8,'DATA (hide)'!$A$4:$Y$30,3,FALSE)","v":"Bu"},{"$f":"VLOOKUP(R8,'DATA (hide)'!$A$4:$Y$30,4,FALSE)","v":1},{"$f":"VLOOKUP(R8,'DATA (hide)'!$A$4:$Y$30,15,FALSE)","v":0},{"$f":"VLOOKUP(R8,'DATA (hide)'!$A$4:$Y$30,14,FALSE)","v":0},{"$f":"VLOOKUP(R8,'DATA (hide)'!$A$4:$Y$30,18,FALSE)","v":0},{"$f":"VLOOKUP(R8,'DATA (hide)'!$A$4:$Y$30,10,FALSE)","v":0},null,{"$f":"VLOOKUP(R8,'DATA (hide)'!$A$4:$Y$30,19,FALSE)","v":10}]
[]
[null,null,"Seeding","Seeding Rate",null,{"$f":"E10&\" of\"","v":"Bu of"},"Seed Cost",null,"Seeds","Seeds","Seeds","Seed per"]
[null,null,"Rate",null,null,"Seed ",null,null,"per","per","per","100ft. Row"]
[null,null,"(lb./acre)",{"$f":"\"(\"&E10&\"/ac)\"","v":"(Bu/ac)"},{"$f":"\"(acres/\"&E10&\")\"","v":"(acres/Bu)"},"Required","$/acre","Total $","Pound","Sq. Foot","Foot Row","(grams)"]
[null,null,{"$f":"IF(H10=0,0,ROUND(((J10*H10)/(G10*I10))/10.4,1))","v":120},{"$f":"SUM(C15/F10)","v":2},{"$f":"IF(C15=0,0,SUM(F10/C15))","v":0.5},{"$f":"C10*D15","v":320},{"$f":"C15*(D10/F10)","v":34},{"$f":"SUM(C10*G15)","v":5440},{"$f":"IF(H10=0,0,ROUND((1000*453.592)/H10,0))","v":12600},{"$f":"IF(J10=0,0,(J10)/(G10*I10))","v":34.674922600619198},{"$f":"IF(H10=0,0,ROUND(((L15/100)*1000)/H10,1))","v":29},{"$f":"ROUND((C15*L10)/11.5,1)","v":104.3}]
{"$rows_left_out":14}
{"sheet":"Speciality Crop","index":2,"n_rows":30,"n_cols":28,"rows_kept":30,"cut":false,"hidden":false,"merged":[[11,6,12,7],[27,0,28,11],[7,9,7,10],[8,9,8,10],[9,9,9,10],[18,2,18,10],[11,3,12,4],[8,25,8,26],[9,25,9,26],[6,9,6,10],[6,13,6,14],[6,25,6,26],[7,25,7,26]]}
[]
[". . . . . . . . . . . . . . . . . . . . . . . . . . . . . . . . . . . . . . . . . . . . . . . . . . . . . . . . . . . . . . . . . . . . ."]
["Speciality Crop - Seeding Rate & Cost Calculator   ",null,null,null,null,null,null,null,null,null,"Printed:",{"$f":"TODAY()","v":"2025-05-13"}]
[]
[null,null,null,"*** Enter changes to BLUE values only ***",null,null,null,null,null,null,null,"Version 1.0"]
[]
[null,null,null,null,null,null,"Seed","1,000 Seed","Seed Survival1","Target Plant Stand Population",null,"Row ",null,null,null,null,null,null,null,null,null,null,"Seed","1,000 Seed","Seed Survival","Target Plant Stand Population",null,"Row "]
[null,"Soybeans",null,"Price",null,"Seeds","Germ","Wt. (grams)","Expected %","Plants/Acre",null,"Spacing",null,null,null,null,null,"(Select Crop - Other)",null,"Price",null,"Seeds","Germ","Wt. (grams)","Expected %","Plants/Acre",null,"Spacing"]
[null,null,"Acres",{"$f":"\"per \"&E10","v":"per Unit"},"unit",{"$f":"\"per \"&E10","v":"per Unit"},"%",{"$f":"\"(Range \"&VLOOKUP(B8,'DATA (hide)'!$A$4:$Y$30,12,FALSE)&\"-\"&VLOOKUP(B8,'DATA (hide)'!$A$4:$Y$30,13,FALSE)&\")\"","v":"(Range 100-200)"},{"$f":"\"(Range \"&VLOOKUP(B8,'DATA (hide)'!$A$4:$Y$30,16,FALSE)&\"-\"&VLOOKUP(B8,'DATA (hide)'!$A$4:$Y$30,17,FALSE)&\"%)\"","v":"(Range 75-80%)"},{"$f":"\"(Range \"&TEXT(VLOOKUP(B8,'DATA (hide)'!$A$4:$Y$30,8,FALSE),\"#,###\")&\"-\"&TEXT(VLOOKUP(B8,'DATA (hide)'!$A$4:$Y$30,9,FALSE),\"#,###\")&\")\"","v":"(Range 150,000-200,000)"},null,"(inches)",null,null,null,null,null,null,"Acres",{"$f":"\"per \"&U10","v":"per Bag"},"unit",{"$f":"\"per \"&U10","v":"per Bag"},"%",{"$f":"\"(Range \"&VLOOKUP(R8,'DATA (hide)'!$A$4:$Y$30,12,FALSE)&\"-\"&VLOOKUP(R8,'DATA (hide)'!$A$4:$Y$30,13,FALSE)&\")\"","v":"(Range 0-0)"},{"$f":"\"(Range \"&VLOOKUP(R8,'DATA (hide)'!$A$4:$Y$30,16,FALSE)&\"-\"&VLOOKUP(R8,'DATA (hide)'!$A$4:$Y$30,17,FALSE)&\"%)\"","v":"(Range 0-0%)"},{"$f":"\"(Range \"&TEXT(VLOOKUP(R8,'DATA (hide)'!$A$4:$Y$30,8,FALSE),\"#,###\")&\"-\"&TEXT(VLOOKUP(R8,'DATA (hide)'!$A$4:$Y$30,9,FALSE),\"#,###\")&\")\"","v":"(Range -)"},null,"(inches)"]
[null,"Enter Variety Name Here",160,{"$f":"VLOOKUP(B8,'DATA (hide)'!$A$4:$Y$30,2,FALSE)","v":62.94},{"$f":"VLOOKUP(B8,'DATA (hide)'!$A$4:$Y$30,3,FALSE)","v":"Unit"},{"$f":"VLOOKUP(B8,'DATA (hide)'!$A$4:$Y$30,4,FALSE)","v":140000},{"$f":"VLOOKUP(B8,'DATA (hide)'!$A$4:$Y$30,15,FALSE)","v":0.9},{"$f":"VLOOKUP(B8,'DATA (hide)'!$A$4:$Y$30,14,FALSE)","v":150},{"$f":"VLOOKUP(B8,'DATA (hide)'!$A$4:$Y$30,18,FALSE)","v":0.9},{"$f":"VLOOKUP(B8,'DATA (hide)'!$A$4:$Y$30,10,FALSE)","v":162000},null,{"$f":"VLOOKUP(B8,'DATA (hide)'!$A$4:$Y$30,19,FALSE)","v":10},null,null,null,null,null,"Enter Variety Name Here",0,{"$f":"VLOOKUP(R8,'DATA (hide)'!$A$4:$Y$30,2,FALSE)","v":0},{"$f":"VLOOKUP(R8,'DATA (hide)'!$A$4:$Y$30,3,FALSE)","v":"Bag"},{"$f":"VLOOKUP(R8,'DATA (hide)'!$A$4:$Y$30,4,FALSE)","v":1},{"$f":"VLOOKUP(R8,'DATA (hide)'!$A$4:$Y$30,15,FALSE)","v":0},{"$f":"VLOOKUP(R8,'DATA (hide)'!$A$4:$Y$30,14,FALSE)","v":0},{"$f":"VLOOKUP(R8,'DATA (hide)'!$A$4:$Y$30,18,FALSE)","v":0},{"$f":"VLOOKUP(R8,'DATA (hide)'!$A$4:$Y$30,10,FALSE)","v":0},null,{"$f":"VLOOKUP(R8,'DATA (hide)'!$A$4:$Y$30,19,FALSE)","v":10}]
[]
[null,null,"Seeding","Seeding Rate",null,{"$f":"E10&\" of\"","v":"Unit of"},"Seed Cost",null,"Seeds","Seeds","Seeds","Seed per"]
[null,null,"Rate",null,null,"Seed ",null,null,"per","per","per","100ft. Row"]
[null,null,"(lb./acre)",{"$f":"\"(\"&E10&\"/ac)\"","v":"(Unit/ac)"},{"$f":"\"(acres/\"&E10&\")\"","v":"(acres/Unit)"},"Required","$/acre","Total $","Pound","Acre","Foot Row","(grams)"]
[null,null,{"$f":"IF(H10=0,0,ROUND(((J10/1000)*(H10/453.6)/(G10*I10)),2))","v":66.14},{"$f":"IF(C15=0,0,SUM(C15/((H10/453.592)*(F10/1000))))","v":1.4285988038095239},{"$f":"IF(H10=0,0,SUM(F10/J15))","v":0.7},{"$f":"C10*D15","v":228.57580860952382},{"$f":"D15*D10","v":89.916008711771426},{"$f":"SUM(C10*G15)","v":14386.561393883429},{"$f":"IF(H10=0,0,ROUND((1000*453.592)/H10,0))","v":3024},{"$f":"IF(H10=0,0,ROUND((J10)/(G10*I10),-3))","v":200000},{"$f":"IF(H10=0,0,ROUND(((L15/100)*1000)/H10,1))","v":3.8},{"$f":"ROUND((C15*L10)/11.5,1)","v":57.5}]
{"$rows_left_out":16}
{"sheet":"DATA (hide)","index":3,"n_rows":38,"n_cols":25,"rows_kept":38,"cut":false,"hidden":true,"merged":[]}
[null,"Seed and Treatment",null,null,"Seed","Seeding","Seeding","Target Plant Stand Population",null,null,null,"1,000 Kernal Weight",null,null,"Seed","Seed Survival (Emergence)",null,null,"Row","Seed per","Seed","Seeds","Seeds per pound"]
[null,"Price",null,"Number","Cost","Rate","Rate","low range","high range","Optimal","Optimal","low range","high range","Actual","Germination","low range","high range","Expected","Spacing","100 ft. row","/ft. of","per","low","high"]
["Crop","per Unit","unit","per unit","($/acre)","(lb./acre)","(units/ac)","per ft.2","per ft.2","per ft.2","per m2","(grams)","(grams)","(grams)","%","%","%","%","(inches)","(grams)","row","acre","range","range","Actual"]
["(Select Crop)",0,"Bu",1,{"$f":"F4*(B4/D4)","v":0},{"$f":"IF(N4=0,0,ROUND(((J4*N4)/(O4*R4))/10.4,2))","v":0},{"$f":"SUM(F4/D4)","v":0},0,0,0,{"$f":"ROUND(J4*10.7639,0)","v":0},0,0,0,0,0,0,0,10,{"$f":"ROUND((F4*S4)/11.5,1)","v":0},{"$f":"IF(N4=0,0,ROUND(((T4/100)*1000)/N4,1))","v":0},{"$f":"IF(J4=0,0,(J4*43560)/(O4*R4))","v":0},{"$f":"IF(M4=0,0,ROUND((1000*453.592)/M4,0))","v":0},{"$f":"IF(L4=0,0,ROUND((1000*453.592)/L4,0))","v":0},{"$f":"IF(N4=0,0,ROUND((1000*453.592)/N4,0))","v":0}]
["Canola",825,"Bag",50,{"$f":"F5*(B5/D5)","v":82.664999999999992},{"$f":"ROUND(((J5*N5)/(O5*R5))/10.4,2)","v":5.01},{"$f":"SUM(F5/D5)","v":0.1002},3,12,7.5,81,3,7,4.95,0.95,40,80,0.75,10,{"$f":"ROUND((F5*S5)/11.5,1)","v":4.4000000000000004},{"$f":"ROUND(((T5/100)*1000)/N5,1)","v":8.9},{"$f":"(J5*43560)/(O5*R5)","v":458526.31578947377},{"$f":"ROUND((1000*453.592)/M5,0)","v":64799},{"$f":"ROUND((1000*453.592)/L5,0)","v":151197},{"$f":"ROUND((1000*453.592)/N5,0)","v":91635}]
["Wheat - Hard Red Spring",17,"Bu",60,{"$f":"F6*(B6/D6)","v":34.008499999999998},120.03,2.0005000000000002,23,28,28,301,31,38,36,0.95,85,90,0.85,10,104.4,29,1510439.628482972,11937,14632,12600]
["Wheat - Northern Hard Red",17,"Bu",60,34.008499999999998,120.03,2.0005000000000002,23,28,28,301,31,38,36,0.95,85,90,0.85,10,104.4,29,1510439.628482972,11937,14632,12600]
["Wheat - Prairie Spring",17,"Bu",60,42.511333333333333,150.04,2.5006666666666666,23,28,28,301,39,50,45,0.95,85,90,0.85,10,130.5,29,1510439.628482972,9072,11631,10080]
["Wheat - Winter",17,"Bu",60,37.448166666666665,132.16999999999999,2.202833333333333,30,35,30,323,30,40,37,0.95,85,90,0.85,10,114.9,31.1,1618328.173374613,11340,15120,12259]
["Wheat - Special Purpose",17,"Bu",60,34.008499999999998,120.03,2.0005000000000002,23,28,28,301,31,38,36,0.95,85,90,0.85,10,104.4,29,1510439.628482972,11937,14632,12600]
["Oats",10,"Bu",32,25.056250000000002,80.180000000000007,2.5056250000000002,20,30,23,248,30,45,31,0.95,85,90,0.9,10,69.7,22.5,1171789.4736842106,10080,15120,14632]
["Barley",10,"Bu",48,{"$f":"F12*(B12/D12)","v":19.9375},{"$f":"ROUND(((J12*N12)/(O12*R12))/10.4,2)","v":95.7},{"$f":"SUM(F12/D12)","v":1.9937500000000001},22,25,23,{"$f":"ROUND(J12*10.7639,0)","v":248},30,45,37,0.95,85,90,0.9,10,{"$f":"ROUND((F12*S12)/11.5,1)","v":83.2},{"$f":"ROUND(((T12/100)*1000)/N12,1)","v":22.5},{"$f":"(J12*43560)/(O12*R12)","v":1171789.4736842106},{"$f":"ROUND((1000*453.592)/M12,0)","v":10080},{"$f":"ROUND((1000*453.592)/L12,0)","v":15120},{"$f":"ROUND((1000*453.592)/N12,0)","v":12259}]
["Peas",28.33,"Bu",60,93.455948333333325,197.93,3.2988333333333335,7,9,8,86,125,300,220,0.95,85,90,0.9,10,172.1,7.8,407578.94736842107,1512,3629,2062]
["Flaxseed",54,"Bu",56,56.39142857142857,58.48,1.0442857142857143,28,48,40,431,5,6.5,6.5,0.95,40,75,0.45,10,50.9,78.3,4075789.4736842108,69783,90718,69783]
["Hempseed",2.35,"Lb",1,{"$f":"F15*(B15/D15)","v":59.807499999999997},{"$f":"ROUND(((J15*N15)/(O15*R15))/10.4,2)","v":25.45},{"$f":"SUM(F15/D15)","v":25.45},10,12,11,{"$f":"ROUND(J15*10.7639,0)","v":118},13.5,21.5,16,0.95,70,75,0.7,10,{"$f":"ROUND((F15*S15)/11.5,1)","v":22.1},{"$f":"ROUND(((T15/100)*1000)/N15,1)","v":13.8},{"$f":"(J15*43560)/(O15*R15)","v":720541.35338345869},{"$f":"ROUND((1000*453.592)/M15,0)","v":21097},{"$f":"ROUND((1000*453.592)/L15,0)","v":33599},{"$f":"ROUND((1000*453.592)/N15,0)","v":28350}]
{"$rows_left_out":24}
{"sheet":"names (hide)","index":4,"n_rows":66,"n_cols":3,"rows_kept":66,"cut":false,"hidden":true,"merged":[]}
[]
[]
[]
["UNIT","ROW","CROP"]
["Lb",5.5]
["Bu",{"$f":"SUM(B5+0.5)","v":6}]
["Bag",6.5]
["Unit",7]
["Kg",7.5]
["Tonne",8]
[null,8.5]
[null,9]
[null,9.5]
[null,10]
[null,10.5]
{"$rows_left_out":52}
{"sheet":"Seeding Rates DV (hide)","index":5,"n_rows":42,"n_cols":12,"rows_kept":42,"cut":false,"hidden":true,"merged":[[0,9,0,10],[0,13,0,14],[1,3,1,4],[1,9,1,10],[1,11,1,12],[1,13,1,14]]}
[null,null,null,null,null,null,"Emergence"]
["Crop","Variety",null,"Optimal Targeted Stand",null,"Germination (%)","Mortality (%)","Row Spacing","TKW","Targeted Seeding Rate"]
["Wheat","Brandon",null,32,"plants/ft2",99,15,7.5,39.159999999999997,{"$f":"((D3*I3)/((F3/100)*(1-(G3/100))))/10.4","v":143.18753142282551},"lbs/ac"]
[null,null,null,"32-34",null,null,"10-15%",null,null,{"$f":"SUM(J3*H3/11.5)","v":93.383172667060123},"grams seed/100ft row"]
[null,null,null,null,null,null,null,null,null,{"$f":"((J4/100)*1000)/I3","v":23.846571161149164},"seeds/ft of row"]
[]
["Oats","ORE3542",null,29,"plants/ft2",99,15,7.5,40.299999999999997,{"$f":"((D7*I7)/((F7/100)*(1-(G7/100))))/10.4","v":133.54129530600116},"lbs/ac"]
[null,null,null,"28-30",null,null,"10-15%",null,null,{"$f":"SUM(J7*H7/11.5)","v":87.092149112609462},"grams seed/100ft row"]
[null,null,null,null,null,null,null,null,null,{"$f":"((J8/100)*1000)/I7","v":21.610955114791434},"seeds/ft of row"]
[]
["Canola","L233P",null,7,"plants/ft2",99,25,7.5,4.3,{"$f":"((D11*I11)/((F11/100)*(1-(G11/100))))/10.4","v":3.8979538979538981},"lbs/ac"]
[null,null,null,null,null,null,null,null,null,{"$f":"SUM(J11*H11/11.5)","v":2.5421438464916726},"grams seed/100ft row"]
[null,null,null,null,null,null,null,null,null,{"$f":"((J12/100)*1000)/I11","v":5.9119624337015644},"seeds/ft of row"]
[null,null,null,7,"plants/ft2",99,25,15,4.3,{"$f":"((D14*I14)/((F14/100)*(1-(G14/100))))/10.4","v":3.8979538979538981},"lbs/ac"]
[null,null,null,"7 to 14",null,null,"20-60%",null,null,{"$f":"SUM(J14*H14/11.5)","v":5.0842876929833452},"grams seed/100ft row"]
{"$rows_left_out":27}