{"text_format":"1","workbook":"xlsx","n_sheets":11,"sheets":["Introduction","Summary","Risk Analysis","Charts","Seed & Fertility","Op. Cost Input","Fixed Cost Input","Assumptions","Chart data (HIDE)","Ag Days (HIDE)","For PPT (HIDE)"],"not_rendered":{"charts":53,"images":4,"macros":1,"external_links":0,"defined_names":96,"comments":1,"pivot_tables":0},"unopened":[],"bounds":{"document_bytes":16777216,"sheet_cells":100000,"rows_first":2000,"rows_last":500,"rows_between":2000,"halvings":0,"cell_chars":16384,"cell_head_chars":4096},"cells_cut":0,"cells_raw":0,"read":"whole","date_system":"1900"}

{"sheet":"Introduction","index":0,"n_rows":43,"n_cols":9,"rows_kept":43,"cut":false,"hidden":false,"merged":[[42,1,44,8],[5,0,5,8],[4,0,4,8],[6,0,6,8],[14,1,19,8],[20,1,24,8]]}
[]
[]
[". . . . . . . . . . . . . . . . . . . . . . . . . . . . . . . . . . . . . . . . . . . . . . . . . "]
[]
["Guidelines For Estimating"]
[{"$f":"\"Organic Crop Production Costs - \"&I11","v":"Organic Crop Production Costs - 2023"}]
[]
[]
{"$rows_left_out":36}
{"sheet":"Summary","index":1,"n_rows":65,"n_cols":27,"rows_kept":65,"cut":false,"hidden":false,"merged":[[0,14,0,17],[64,1,65,9],[31,2,31,9],[0,0,0,12],[50,2,50,9]]}
[{"$f":"\"Organic Crop Production Costs \"&Introduction!I11&\" Guidelines (Dollars Per Acre)\"","v":"Organic Crop Production Costs 2023 Guidelines (Dollars Per Acre)"},null,null,null,null,null,null,null,null,null,null,null,null,null,"Organic Green Manure Crops",null,null,null,null,"Underseed"]
[null,null,null,null,"HRS",null,"Hemp","Soy-",null,null,"Winter","Buck-","Sunflower",null,"Sweet","Oat / Pea","Forage"]
[null,null,"Flax","Peas","Wheat","Oats","Oil","beans","Barley","Fall Rye","Wheat","wheat","Oil",null,"Clover","Mix","Peas","Alfalfa",null,"Red Clover",null,"Your Farm"]
["A.  Operating Costs",null,null,null,null,null,null,null,null,null,null,null,"**mustard"]
[null,"Seed & Treatment",{"$f":"'Seed & Fertility'!G5","v":75},{"$f":"'Seed & Fertility'!G6","v":75},{"$f":"'Seed & Fertility'!G7","v":60.48},{"$f":"'Seed & Fertility'!G8","v":60},{"$f":"'Seed & Fertility'!G9","v":53.75},{"$f":"'Seed & Fertility'!G10","v":84},{"$f":"'Seed & Fertility'!G11","v":37.5},{"$f":"'Seed & Fertility'!G12","v":30},{"$f":"'Seed & Fertility'!G13","v":48},{"$f":"'Seed & Fertility'!G14","v":35.75},{"$f":"'Seed & Fertility'!G15","v":16},null,{"$f":"'Seed & Fertility'!G18","v":15.75},{"$f":"'Seed & Fertility'!G19","v":74.8},{"$f":"'Seed & Fertility'!G20","v":50},{"$f":"'Seed & Fertility'!G21","v":15},null,{"$f":"'Seed & Fertility'!G24","v":32.5},null,null,null,null,null,null,{"$f":"AVERAGE(F5,C5,E5,I5)","v":58.244999999999997}]
[null,"Fertility",{"$f":"'Seed & Fertility'!$E$40","v":171.69400204712957},{"$f":"'Seed & Fertility'!$E$40","v":171.69400204712957},{"$f":"'Seed & Fertility'!$E$40","v":171.69400204712957},{"$f":"'Seed & Fertility'!$E$40","v":171.69400204712957},{"$f":"'Seed & Fertility'!$E$40","v":171.69400204712957},{"$f":"'Seed & Fertility'!$E$40","v":171.69400204712957},{"$f":"'Seed & Fertility'!$E$40","v":171.69400204712957},{"$f":"'Seed & Fertility'!$E$40","v":171.69400204712957},{"$f":"'Seed & Fertility'!$E$40","v":171.69400204712957},{"$f":"IF('Seed & Fertility'!$D$38=\"error\",\"ERROR\",SUM((($O$30*'Seed & Fertility'!$E$33)+($P$30*'Seed & Fertility'!$E$34)+($T$30*'Seed & Fertility'!$E$35)+($Q$30*'Seed & Fertility'!$E$36)+($R$30*'Seed & Fertility'!$E$37))/('Seed & Fertility'!$G$29-'Seed & Fertility'!$D$29)))","v":152.73275204712957},{"$f":"IF('Seed & Fertility'!$D$38=\"error\",\"ERROR\",SUM((($O$30*'Seed & Fertility'!$E$33)+($P$30*'Seed & Fertility'!$E$34)+($T$30*'Seed & Fertility'!$E$35)+($Q$30*'Seed & Fertility'!$E$36)+($R$30*'Seed & Fertility'!$E$37))/('Seed & Fertility'!$G$29-'Seed & Fertility'!$D$29)))","v":152.73275204712957},null,null,null,null,null,null,null,null,null,null,null,null,null,{"$f":"AVERAGE(F6,C6,E6,I6)","v":171.69400204712957}]
[null,"Compost",{"$f":"'Seed & Fertility'!$E$55","v":15.975000000000001},{"$f":"'Seed & Fertility'!$E$55","v":15.975000000000001},{"$f":"'Seed & Fertility'!$E$55","v":15.975000000000001},{"$f":"'Seed & Fertility'!$E$55","v":15.975000000000001},{"$f":"'Seed & Fertility'!$E$55","v":15.975000000000001},{"$f":"'Seed & Fertility'!$E$55","v":15.975000000000001},{"$f":"'Seed & Fertility'!$E$55","v":15.975000000000001},{"$f":"'Seed & Fertility'!$E$55","v":15.975000000000001},{"$f":"'Seed & Fertility'!$E$55","v":15.975000000000001},{"$f":"SUM('Seed & Fertility'!$E$53*('Seed & Fertility'!$C$43/'Seed & Fertility'!$F$43))","v":15.975000000000001},{"$f":"SUM('Seed & Fertility'!$E$53*('Seed & Fertility'!$C$43/'Seed & Fertility'!$F$43))","v":15.975000000000001},null,{"$f":"'Seed & Fertility'!$E$55","v":15.975000000000001},{"$f":"'Seed & Fertility'!$E$55","v":15.975000000000001},{"$f":"'Seed & Fertility'!$E$55","v":15.975000000000001},{"$f":"'Seed & Fertility'!$E$55","v":15.975000000000001},null,0,null,null,null,null,null,null,15.975000000000001]
[null,"Herbicide",{"$f":"'Seed & Fertility'!D62","v":0},{"$f":"'Seed & Fertility'!D63","v":0},{"$f":"'Seed & Fertility'!D64","v":0},{"$f":"'Seed & Fertility'!D65","v":0},{"$f":"'Seed & Fertility'!D66","v":0},{"$f":"'Seed & Fertility'!D67","v":0},{"$f":"'Seed & Fertility'!D68","v":0},{"$f":"'Seed & Fertility'!D69","v":0},{"$f":"'Seed & Fertility'!D70","v":0},{"$f":"'Seed & Fertility'!D71","v":0},{"$f":"'Seed & Fertility'!D72","v":0},null,{"$f":"'Seed & Fertility'!D75","v":0},{"$f":"'Seed & Fertility'!D76","v":0},{"$f":"'Seed & Fertility'!D77","v":0},{"$f":"'Seed & Fertility'!D78","v":0},null,{"$f":"'Seed & Fertility'!D81","v":0},null,null,null,null,null,null,0]
{"$rows_left_out":58}
{"sheet":"Risk Analysis","index":2,"n_rows":66,"n_cols":13,"rows_kept":66,"cut":false,"hidden":false,"merged":[[19,1,19,9],[65,1,66,9],[0,2,0,7]]}
[null,null," AgriInsurance Analysis"]
[]
[null,null,null,null,"HRS",null,null,"Soy-",null,null,"Winter"]
[null,null,"Flax","Peas","Wheat","Oats","Hemp","beans","Barley","Fall Rye","Wheat",null,"Your Farm"]
[]
["AgriInsurance "]
[null,"80% Insured Value",521.20799999999997,358.74080000000004,550.88480000000004,482.66400000000004,366.08000000000004,386.57600000000002,425.3664,553.76640000000009,565.09440000000006]
[null,"Premium Cost (% of Insured)",{"$f":"IF(Summary!C14=0,\"n/a\",SUM(Summary!C14/C7))","v":0.11002325367223835},{"$f":"IF(Summary!D14=0,\"n/a\",SUM(Summary!D14/D7))","v":6.181343187058734E-2},{"$f":"IF(Summary!E14=0,\"n/a\",SUM(Summary!E14/E7))","v":0.10650593372697886},{"$f":"IF(Summary!F14=0,\"n/a\",SUM(Summary!F14/F7))","v":0.10308931264813617},{"$f":"IF(Summary!G14=0,\"n/a\",SUM(Summary!G14/G7))","v":0.11082277097902096},{"$f":"IF(Summary!H14=0,\"n/a\",SUM(Summary!H14/H7))","v":5.2402373660030623E-2},{"$f":"IF(Summary!I14=0,\"n/a\",SUM(Summary!I14/I7))","v":5.9272429604218857E-2},{"$f":"IF(Summary!J14=0,\"n/a\",SUM(Summary!J14/J7))","v":2.7493542403439424E-2},{"$f":"IF(Summary!K14=0,\"n/a\",SUM(Summary!K14/K7))","v":0.10896409520250067}]
{"$rows_left_out":59}
{"sheet":"Charts","index":3,"n_rows":0,"n_cols":0,"rows_kept":0,"cut":false,"hidden":false,"merged":[]}

{"sheet":"Seed & Fertility","index":4,"n_rows":89,"n_cols":10,"rows_kept":89,"cut":false,"hidden":false,"merged":[[0,1,0,9],[25,1,25,9],[56,0,56,9]]}
[null,"Seed "]
[]
[null,null,"Seeding Rate",null,"Price",null,"Cost"]
[null,"Crop","per Acre",null,"per Unit",null,"per Acre"]
[null,"Flax",60,"lb",1.25,"/lb",{"$f":"ROUND(C5*E5,2)","v":75}]
[null,"Peas",3,"bu",25,"/bu",{"$f":"ROUND(C6*E6,2)","v":75}]
[null,"HRS Wheat",2.16,"bu",28,"/bu",{"$f":"ROUND(C7*E7,2)","v":60.48}]
[null,"Oats",4,"bu",15,"/bu",{"$f":"ROUND(C8*E8,2)","v":60}]
{"$rows_left_out":82}
{"sheet":"Op. Cost Input","index":5,"n_rows":56,"n_cols":21,"rows_kept":56,"cut":false,"hidden":false,"merged":[[0,0,0,13],[9,4,9,13],[10,8,10,13],[32,0,32,13],[34,4,34,11],[34,12,34,13],[35,10,36,10],[35,11,36,11],[35,12,36,12],[35,13,36,13],[35,4,36,4],[35,5,36,5],[35,6,36,6],[35,7,36,7],[35,8,36,8],[35,9,36,9]]}
["Operating Costs"]
[null,null,null,null,null,null,null,null,null,null,null,null,null,null,null,null,null,"Farm Labour Worksheet"]
[null,"Interest Rate on Operating",null,null,7.7499999999999999E-2,null,"Grain Hauling",null,null,null,null,null,null,null,null,null,null,"#","# of","Acres","Hours "]
[null,"Land Taxes  ($/acre)",null,null,17.5,null,"  Distance to storage",null,6,"miles roundtrip",null,null,null,null,null,null,null,"Staff","Months","Farmed","Per Acre"]
[null,"Labour rate ($/hour)",null,null,26,null,"  Distance to market",null,0,"miles roundtrip",null,null,null,null,null,null,null,1,7,600,{"$f":"SUM(R5*S5*4*40)/T5","v":1.8666666666666667}]
[null,"Machinery Operating  ($/acre)",null,null,25,null,"  Grain truck fuel use",null,5,"Miles per Imp. Gallon",null,null,null,null,null,null,null,1,4,{"$f":"T5","v":600},{"$f":"SUM(R6*S6*4*40)/T6","v":1.0666666666666667}]
[null,"Other Costs ($/acre)",null,null,17.75,null,"  Grain truck size",null,475,"bushels",null,null,null,null,null,null,null,0,0,{"$f":"T5","v":600},{"$f":"SUM(R7*S7*4*40)/T7","v":0}]
[null,"Fuel Cost  ($/litre)",null,null,1.65,null,null,null,null,null,null,null,null,null,null,null,null,0,0,{"$f":"T5","v":600},{"$f":"SUM(R8*S8*4*40)/T8","v":0}]
{"$rows_left_out":49}
{"sheet":"Fixed Cost Input","index":6,"n_rows":69,"n_cols":10,"rows_kept":69,"cut":false,"hidden":false,"merged":[[0,0,0,9],[21,0,21,9],[48,0,48,10]]}
["Fixed Costs"]
[]
[null,"Land"]
[null,"  Average Land value ($/acre)",null,3750,null,null,"Machinery"]
[null,"  Organic Crop acres",null,600,null,null,"  Total Investment ($/acre)",null,{"$f":"ROUND((C47)/(D5),2)","v":600}]
[null,"  Owned Land Equity",null,0.85,null,null,"  Residual Value (End of Useful Life)",null,0.25]
[null,"  Land Financed",null,{"$f":"SUM(1-D6)","v":0.15000000000000002},null,null,"  Useful Life (years)",null,15]
[null,"  Land Opportunity Cost (Investment Rate) ",null,1.4999999999999999E-2,null,null,"  Owned Equipment Equity",null,0.55000000000000004]
{"$rows_left_out":62}
{"sheet":"Assumptions","index":7,"n_rows":57,"n_cols":12,"rows_kept":57,"cut":false,"hidden":false,"merged":[[41,0,42,11],[0,0,0,11],[7,0,8,11],[17,0,18,11],[23,0,25,11],[12,0,12,11]]}
["Other Assumptions"]
[]
["Fuel Costs:  Includes fuel used for field work, trucking in inputs and trucking out production."]
[]
["Machinery  Operating Costs:  Includes costs for maintenance, repairs, licenses and insurance."]
[]
["Crop Insurance: (2022 rates) "]
["Risk Area #2 \"D\" soil zone  at 80% coverage and additional hail insurance at $300/acre coverage for all crops.  Flax, HRS Wheat, Oats, Winter Wheat, Peas, Barley and Hemp are based on organic insured values."]
{"$rows_left_out":50}
{"sheet":"Chart data (HIDE)","index":8,"n_rows":91,"n_cols":26,"rows_kept":91,"cut":false,"hidden":true,"merged":[]}
[]
[{"$f":"\"Manitoba Organic Breakeven Yield Risk Ratio - \"&Introduction!I11","v":"Manitoba Organic Breakeven Yield Risk Ratio - 2023"}]
[{"$f":"\"Manitoba Organic Risk & Reward Analysis - \"&Introduction!I11","v":"Manitoba Organic Risk & Reward Analysis - 2023"},null,null,null,"80% Coverage of Total Costs"]
[{"$f":"\"Manitoba Organic - 80% AgriInsurance Risk Analysis - \"&Introduction!I11","v":"Manitoba Organic - 80% AgriInsurance Risk Analysis - 2023"}]
[null,"Operating Costs","80% Insured Value","80% Coverage of Operating Costs","80% Coverage of Total Costs (Risk)","Return on Asset (Reward)","Return on Investment (Reward)",null,null,null,null,"Target Yield as % of B/E Yield"]
["Flax",{"$f":"Summary!C$21","v":481.52152361955814},{"$f":"'Risk Analysis'!C$7","v":521.20799999999997},{"$f":"'Risk Analysis'!C$15","v":1.0824189043142285},{"$f":"SUM(C6/Summary!C$30)","v":0.72686657830601309},{"$f":"Summary!$C$49","v":2.8845626754124568E-2},{"$f":"Summary!$C$48","v":-3.913394949263431E-2},null,null,null,null,{"$f":"Summary!$C$62","v":0.96086605050736562}]
["Peas",{"$f":"Summary!D$21","v":456.39922588375589},{"$f":"'Risk Analysis'!D$7","v":358.74080000000004},{"$f":"'Risk Analysis'!D$15","v":0.78602412023233958},{"$f":"SUM(C7/Summary!D$30)","v":0.51845715143916893},{"$f":"Summary!$D$49","v":-3.4229707099713999E-2},{"$f":"Summary!$D$48","v":-0.43708922853058174},null,null,null,null,{"$f":"Summary!$D$62","v":0.56291077146941826}]
["HRS Wheat",{"$f":"Summary!E$21","v":473.12591412285104},{"$f":"'Risk Analysis'!E$7","v":550.88480000000004},{"$f":"'Risk Analysis'!E$15","v":1.16435135670239},{"$f":"SUM(C8/Summary!E$30)","v":0.77735481420379282},{"$f":"Summary!$E$49","v":4.1580249626930792E-2},{"$f":"Summary!$E$48","v":3.8571300667565062E-2},null,null,null,null,{"$f":"Summary!$E$62","v":1.0385713006675652}]
{"$rows_left_out":84}
{"sheet":"Ag Days (HIDE)","index":9,"n_rows":127,"n_cols":101,"rows_kept":127,"cut":false,"hidden":true,"merged":[[8,45,8,46],[8,50,8,51],[8,55,8,56],[8,60,8,61],[29,45,29,46],[29,50,29,51],[29,55,29,56],[29,60,29,61],[43,45,43,46],[43,50,43,51],[43,55,43,56],[43,60,43,61],[57,45,57,46],[57,50,57,51],[57,55,57,56],[57,60,57,61]]}
[null,null,null,null,null,null,null,null,null,null,null,null,null,null,null,null,null,null,null,null,null,null,null,null,null,null,null,null,null,null,null,null,null,null,null,null,null,null,null,null,null,null,null,null,null,null,null,null,null,null,null,null,null,null,null,null,null,null,null,null,null,null,null,null,null,null,"Organic",null,null,null,null,null,null,"Organic",null,null,null,null,null,"Organic",null,null,null,null,"Organic",null,null,null,null,null,null,"Organic",null,null,null,null,"Organic"]
[null,null,null,null,null,null,null,null,null,null,null,null,null,null,null,null,null,null,null,null,null,null,null,null,null,null,null,null,null,null,null,null,null,null,null,null,null,null,null,null,null,null,null,null,null,null,null,null,null,null,null,null,null,null,null,null,null,null,null,null,null,null,null,null,null,null,null,null,null,null,null,null,null,"B/E Yield (Units/Acre)",null,null,null,null,null,"Projected Revenue & Crop Rankings 2016",null,null,null,null,null,null,null,null,null,null,null,"B/E Prices",null,null,null,null,"AgriInsurance Risk Analysis - RA#2 'B' Soil"]
[null,null,null,null,null,null,null,null,null,null,null,null,null,null,null,null,null,null,null,null,null,null,null,null,null,null,null,null,null,null,null,null,null,null,null,null,null,null,null,null,null,null,null,null,null,null,null,null,null,null,null,null,null,null,null,null,null,null,null,null,null,null,null,null,null,null,null,"Price","Yield","Margin Over","Margin Over",null,null,null,"Price","Operating","Total","B/E % of Target",null,null,"Price","Yield","Gross",null,null,"Gross","Margin Over","Margin Over Op","Margin Over",null,null,null,"Yield","Operating","Total",null,null,"Operating","80% Insured","Coverage of","Coverage of"]
[null,null,null,null,null,null,null,null,null,null,null,null,null,null,null,null,null,null,null,null,null,null,null,null,null,null,null,null,null,null,null,null,null,null,null,null,null,null,null,null,null,null,null,null,null,null,null,null,null,null,null,null,null,null,null,null,null,null,null,null,null,null,null,null,null,null,null,"($/unit)","(units/acre)","Operating Costs"," Total Costs","Rank",null,null,"($/unit)","Costs","Costs","(or Avg.) Yield",null,null,"($/unit)","(units/acre)","Revenue",null,null,"Revenue","Operating Costs","& Fixed Costs"," Total Costs","Rank",null,null,"(units/acre)","Costs","Costs",null,null,"Costs","Value","Operating Costs","Total Costs"]
[null,null,null,null,null,null,null,null,null,null,null,null,null,null,null,null,null,null,null,null,null,null,null,null,null,null,null,null,null,null,null,null,null,null,null,null,null,null,null,null,null,null,null,null,null,null,null,null,null,null,null,null,null,null,null,null,null,null,null,null,null,null,null,null,null,null,{"$f":"$B$116","v":"Brown Flax"},{"$f":"$I$116","v":34},{"$f":"$H$116","v":15.5},{"$f":"$L$116","v":309.26908581228065},{"$f":"$N$116","v":161.75596602061398},1,null,{"$f":"$B$116","v":"Brown Flax"},{"$f":"$I$116","v":34},{"$f":"$Q$116","v":6.4038504172858621},{"$f":"$R$116","v":10.742471587629},{"$f":"$S$116","v":0.69306268307283869},null,{"$f":"$B$116","v":"Brown Flax"},{"$f":"$I$116","v":34},{"$f":"$H$116","v":15.5},{"$f":"$J$116","v":527},null,{"$f":"$B$116","v":"Brown Flax"},{"$f":"$J$116","v":527},{"$f":"$L$116","v":309.26908581228065},{"$f":"$M$116","v":225.75596602061398},{"$f":"$N$116","v":161.75596602061398},1,null,{"$f":"$B$116","v":"Brown Flax"},{"$f":"$H$116","v":15.5},{"$f":"$Z$116","v":14.047155754046408},{"$f":"$AA$116","v":23.564131224476519},null,{"$f":"$B$116","v":"Brown Flax"},{"$f":"$C$116","v":217.73091418771932},{"$f":"$V$116","v":195.52},{"$f":"$W$116","v":0.89798915661296541},{"$f":"$X$116","v":0.53531332974773504}]
[null,null,null,null,null,null,null,null,null,null,null,null,null,null,null,null,null,null,null,null,null,null,null,null,null,null,null,null,null,null,null,null,null,null,null,null,null,null,null,null,null,null,null,null,null,null,null,null,null,null,null,null,null,null,null,null,null,null,null,null,null,null,null,null,null,null,{"$f":"$B$117","v":"Green Peas"},{"$f":"$I$117","v":15.38},{"$f":"$H$117","v":20},{"$f":"$L$117","v":97.765157096491208},{"$f":"$N$117","v":-50.336197070175444},2,null,{"$f":"$B$117","v":"Green Peas"},{"$f":"$I$117","v":15.38},{"$f":"$Q$117","v":13.643357796066892},{"$f":"$R$117","v":23.272834659959393},{"$f":"$S$117","v":1.1636417329979696},null,{"$f":"$B$117","v":"Green Peas"},{"$f":"$I$117","v":15.38},{"$f":"$H$117","v":20},{"$f":"$J$117","v":307.60000000000002},null,{"$f":"$B$117","v":"Green Peas"},{"$f":"$J$117","v":307.60000000000002},{"$f":"$L$117","v":97.765157096491208},{"$f":"$M$117","v":13.663802929824556},{"$f":"$N$117","v":-50.336197070175444},2,null,{"$f":"$B$117","v":"Green Peas"},{"$f":"$H$117","v":20},{"$f":"$Z$117","v":10.49174214517544},{"$f":"$AA$117","v":17.896809853508774},null,{"$f":"$B$117","v":"Green Peas"},{"$f":"$C$117","v":209.83484290350881},{"$f":"$V$117","v":100.16},{"$f":"$W$117","v":0.47732778128777176},{"$f":"$X$117","v":0.27982640710786522}]
["Organic",null,null,null,null,null,null,null,null,null,null,null,null,null,null,null,null,null,null,null,null,"Conventional",null,null,null,null,null,null,null,null,null,null,null,null,null,null,null,null,null,null,null,null,null,"PPT",null,null,null,null,null,null,null,null,null,null,null,null,null,null,null,null,null,null,null,null,null,null,{"$f":"$B$118","v":"Wheat"},{"$f":"$I$118","v":18.86},{"$f":"$H$118","v":35},{"$f":"$L$118","v":443.10872804385963},{"$f":"$N$118","v":293.04659262719298},3,null,{"$f":"$B$118","v":"Wheat"},{"$f":"$I$118","v":18.86},{"$f":"$Q$118","v":11.505369668936392},{"$f":"$R$118","v":19.46200463270451},{"$f":"$S$118","v":0.55605727522012882},null,{"$f":"$B$118","v":"Wheat"},{"$f":"$I$118","v":18.86},{"$f":"$H$118","v":35},{"$f":"$J$118","v":660.1},null,{"$f":"$B$118","v":"Wheat"},{"$f":"$J$118","v":660.1},{"$f":"$L$118","v":443.10872804385963},{"$f":"$M$118","v":357.04659262719298},{"$f":"$N$118","v":293.04659262719298},3,null,{"$f":"$B$118","v":"Wheat"},{"$f":"$H$118","v":35},{"$f":"$Z$118","v":6.1997506273182958},{"$f":"$AA$118","v":10.487240210651629},null,{"$f":"$B$118","v":"Wheat"},{"$f":"$C$118","v":216.99127195614037},{"$f":"$V$118","v":170.78},{"$f":"$W$118","v":0.78703626399553583},{"$f":"$X$118","v":0.46527289100069025}]
[null,null,null,null,null,null,null,null,null,null,null,null,null,null,null,null,null,null,null,null,null,null,null,null,null,null,null,null,null,null,null,null,null,null,null,null,null,null,null,null,null,null,null,null,null,null,null,null,null,null,null,null,null,null,null,null,null,null,null,null,null,null,null,null,null,null,{"$f":"$B$119","v":"Oats"},{"$f":"$I$119","v":7},{"$f":"$H$119","v":75},{"$f":"$L$119","v":330.4982505701754},{"$f":"$N$119","v":175.20736515350876},4,null,{"$f":"$B$119","v":"Oats"},{"$f":"$I$119","v":7},{"$f":"$Q$119","v":27.785964204260654},{"$f":"$R$119","v":49.970376406641606},{"$f":"$S$119","v":0.66627168542188808},null,{"$f":"$B$119","v":"Oats"},{"$f":"$I$119","v":7},{"$f":"$H$119","v":75},{"$f":"$J$119","v":525},null,{"$f":"$B$119","v":"Oats"},{"$f":"$J$119","v":525},{"$f":"$L$119","v":330.4982505701754},{"$f":"$M$119","v":239.20736515350876},{"$f":"$N$119","v":175.20736515350876},4,null,{"$f":"$B$119","v":"Oats"},{"$f":"$H$119","v":75},{"$f":"$Z$119","v":2.5933566590643276},{"$f":"$AA$119","v":4.6639017979532165},null,{"$f":"$B$119","v":"Oats"},{"$f":"$C$119","v":194.50174942982457},{"$f":"$V$119","v":167.27},{"$f":"$W$119","v":0.85999226480145541},{"$f":"$X$119","v":0.47819760434180536}]
{"$rows_left_out":120}
{"sheet":"For PPT (HIDE)","index":10,"n_rows":393,"n_cols":102,"rows_kept":393,"cut":false,"hidden":true,"merged":[[65,1,66,8],[34,2,34,8],[34,9,34,18],[2,11,2,12],[65,10,66,20],[51,2,51,8],[51,9,51,18],[0,10,0,20],[0,0,0,9],[0,22,0,35],[38,24,38,32],[53,24,53,32]]}
["Crop Production Costs 2017 Guidelines (Dollars Per Acre)",null,null,null,null,null,null,null,null,null,"Crop Production Costs 2017 Guidelines (Dollars Per Acre)",null,null,null,null,null,null,null,null,null,null,null,{"$f":"\"Organic Crop Production Costs \"&Introduction!AE11&\" Guidelines (Dollars Per Acre)\"","v":"Organic Crop Production Costs  Guidelines (Dollars Per Acre)"}]
[]
[null,null,null,null,"Winter",null,null,null,null,"Navy",null,"Sunflower",null,null,null,"Canary",null,"Buck-","Hemp-",null,null,null,null,null,"Brown","Green","HRS",null,"Hemp","Spring","Soy-","Feed",null,"Winter","Buck-","Sunflower"]
[null,null,"Canola","Wheat","Wheat","Soybeans","Barley","Oats","Corn","Beans","Flax","Confects","Oil","Peas","Fall Rye","Seed","Lentils","wheat","seed",null,"Your Farm",null,null,null,"Flax","Peas","Wheat","Oats","Oil","Spelt","beans","Barley","Fall Rye","Wheat","wheat","Oil"]
["A.  Operating Costs"]
[null,"Seed & Treatment",60,22,20,95.1,15,17.5,81.2,50,22.8,48.31,38,30.25,10.5,14.08,32.5,25,50]
[null,"Fertilizer",69.32396087505424,52.377244517823101,56.724445016773103,13.252440027273069,45.82130401432758,41.474103515377578,81.074204316819078,48.030044018873092,37.091763261357066,45.82130401432758,45.82130401432758,11.043700022727558,39.300503265902577,41.474103515377578,11.043700022727558,26.223762013982061,48.030044018873092,null,null,null,"A.  Operating Costs"]
[null,"Herbicide",13.81,26.71,13.08,14.67,23.75,8.75,18.670000000000002,64.12,18.63,40.590000000000003,24.91,17.88,6.75,12.58,17.88,5.63,35.090000000000003,null,null,null,null,"Seed & Treatment",47.14,45.95,47.52,42,62.5,52.5,75.599999999999994,27.5,25,39,35.75,16]
{"$rows_left_out":385}