{"text_format":"1","workbook":"xlsx","n_sheets":13,"sheets":["Introduction","Summary","S.O.S.","Risk Analysis","Charts","Seed, Fertilizer & Chemical","Op. Cost Input","Fixed Cost Input","Assumptions","Data (HIDE)","Weekly Bushels (HIDE)","Chart data (HIDE)","COP (HIDE)"],"not_rendered":{"charts":40,"images":4,"macros":1,"external_links":0,"defined_names":149,"comments":4,"pivot_tables":0},"unopened":[],"bounds":{"document_bytes":16777216,"sheet_cells":100000,"rows_first":2000,"rows_last":500,"rows_between":2000,"halvings":0,"cell_chars":16384,"cell_head_chars":4096},"cells_cut":0,"cells_raw":0,"read":"whole","date_system":"1900"}

{"sheet":"Introduction","index":0,"n_rows":53,"n_cols":9,"rows_kept":53,"cut":false,"hidden":false,"merged":[[5,0,5,8],[4,0,4,8],[55,1,55,8],[6,0,6,8],[16,1,22,8],[24,1,26,8],[52,1,54,8],[40,1,43,8]]}
[]
[]
[". . . . . . . . . . . . . . . . . . . . . . . . . . . . . . . . . . . . . . . . . . . . . . . . . "]
[]
["Guidelines For Estimating"]
[{"$f":"\"Crop Production Costs - \"&I11","v":"Crop Production Costs - 2025"}]
{"$rows_left_out":48}
{"sheet":"Summary","index":1,"n_rows":76,"n_cols":42,"rows_kept":76,"cut":false,"hidden":false,"merged":[[75,1,76,8],[0,0,0,9],[75,11,76,18],[0,10,0,19],[31,0,31,9],[31,10,31,19],[54,0,54,9],[54,10,54,19]]}
[{"$f":"IF('Data (HIDE)'!B13=\"Manitoba\",\"Crop Production Costs \"&Introduction!I11&\" Guidelines (Dollars Per Acre)\",\"Crop Production Costs \"&Introduction!I11&\" Guidelines \"&'Data (HIDE)'!B13&\" (Dollars Per Acre)\")","v":"Crop Production Costs 2025 Guidelines (Dollars Per Acre)"},null,null,null,null,null,null,null,null,null,{"$f":"IF('Data (HIDE)'!L13=\"Manitoba\",\"Crop Production Costs \"&Introduction!S11&\" Guidelines (Dollars Per Acre)\",\"Crop Production Costs \"&Introduction!S11&\" Guidelines \"&'Data (HIDE)'!L13&\" (Dollars Per Acre)\")","v":"Crop Production Costs  Guidelines  (Dollars Per Acre)"}]
[null,null,{"$f":"'Data (HIDE)'!$B$16","v":"Wheat - Hard Red Spring"},{"$f":"'Data (HIDE)'!$B$17","v":"Wheat - Northern Hard Red"},{"$f":"'Data (HIDE)'!$B$18","v":"Wheat - Prairie Spring"},{"$f":"'Data (HIDE)'!$B$19","v":"Wheat - Winter"},{"$f":"'Data (HIDE)'!$B$20","v":"Oats"},{"$f":"'Data (HIDE)'!$B$21","v":"Barley"},{"$f":"'Data (HIDE)'!$B$22","v":"Hybrid Fall Rye"},{"$f":"'Data (HIDE)'!$B$23","v":"Corn"},null,null,{"$f":"'Data (HIDE)'!$B$24","v":"Canola"},{"$f":"'Data (HIDE)'!$B$25","v":"Soybeans"},{"$f":"'Data (HIDE)'!$B$26","v":"Sunflower - Oilseed"},{"$f":"'Data (HIDE)'!$B$27","v":"Flaxseed"},{"$f":"'Data (HIDE)'!$B$28","v":"Peas"},{"$f":"'Data (HIDE)'!$B$29","v":"Beans - Pinto"},{"$f":"'Data (HIDE)'!$B$30","v":"Beans - White"},{"$f":"'Data (HIDE)'!$B$31","v":"Beans - Black"}]
["A.  Operating Costs",null,null,null,null,null,null,null,null,null,"A.  Operating Costs"]
[null,"Seed & Treatment",{"$f":"'Data (HIDE)'!$L$16","v":34},{"$f":"'Data (HIDE)'!$L$17","v":34},{"$f":"'Data (HIDE)'!$L$18","v":34},{"$f":"'Data (HIDE)'!$L$19","v":32},{"$f":"'Data (HIDE)'!$L$20","v":25},{"$f":"'Data (HIDE)'!$L$21","v":20},{"$f":"'Data (HIDE)'!$L$22","v":78.400000000000006},{"$f":"'Data (HIDE)'!$L$23","v":100},null,"Seed & Treatment",{"$f":"'Data (HIDE)'!$L$24","v":82.5},{"$f":"'Data (HIDE)'!$L$25","v":90},{"$f":"'Data (HIDE)'!$L$26","v":50},{"$f":"'Data (HIDE)'!$L$27","v":56},{"$f":"'Data (HIDE)'!$L$28","v":85},{"$f":"'Data (HIDE)'!$L$29","v":105},{"$f":"'Data (HIDE)'!$L$30","v":110},{"$f":"'Data (HIDE)'!$L$31","v":115}]
[null,"Fertilizer",{"$f":"'Data (HIDE)'!$M$16","v":113.06977594519662},{"$f":"'Data (HIDE)'!$M$17","v":122.985296265237},{"$f":"'Data (HIDE)'!$M$18","v":116.37494938521009},{"$f":"'Data (HIDE)'!$M$19","v":113.06977594519662},{"$f":"'Data (HIDE)'!$M$20","v":87.783700968189933},{"$f":"'Data (HIDE)'!$M$21","v":84.733791097549911},{"$f":"'Data (HIDE)'!$M$22","v":136.20599002529079},{"$f":"'Data (HIDE)'!$M$23","v":173.17645237710656},null,"Fertilizer",{"$f":"'Data (HIDE)'!$M$24","v":128.36473109809572},{"$f":"'Data (HIDE)'!$M$25","v":44.010542060074854},{"$f":"'Data (HIDE)'!$M$26","v":104.3190181062656},{"$f":"'Data (HIDE)'!$M$27","v":58.566567022832523},{"$f":"'Data (HIDE)'!$M$28","v":29.832727374231503},{"$f":"'Data (HIDE)'!$M$29","v":71.787260782886335},{"$f":"'Data (HIDE)'!$M$30","v":78.397607662913231},{"$f":"'Data (HIDE)'!$M$31","v":78.397607662913231}]
[null,"Crop Protection",{"$f":"'Data (HIDE)'!$N$16+'Data (HIDE)'!$O$16+'Data (HIDE)'!$P$16","v":55.25},{"$f":"'Data (HIDE)'!$N$17+'Data (HIDE)'!$O$17+'Data (HIDE)'!$P$17","v":55.25},{"$f":"'Data (HIDE)'!$N$18+'Data (HIDE)'!$O$18+'Data (HIDE)'!$P$18","v":55.25},{"$f":"'Data (HIDE)'!$N$19+'Data (HIDE)'!$O$19+'Data (HIDE)'!$P$19","v":36},{"$f":"'Data (HIDE)'!$N$20+'Data (HIDE)'!$O$20+'Data (HIDE)'!$P$20","v":24.5},{"$f":"'Data (HIDE)'!$N$21+'Data (HIDE)'!$O$21+'Data (HIDE)'!$P$21","v":27.5},{"$f":"'Data (HIDE)'!$N$22+'Data (HIDE)'!$O$22+'Data (HIDE)'!$P$22","v":8.5},{"$f":"'Data (HIDE)'!$N$23+'Data (HIDE)'!$O$23+'Data (HIDE)'!$P$23","v":44},null,"Crop Protection",{"$f":"'Data (HIDE)'!$N$24+'Data (HIDE)'!$O$24+'Data (HIDE)'!$P$24","v":58.5},{"$f":"'Data (HIDE)'!$N$25+'Data (HIDE)'!$O$25+'Data (HIDE)'!$P$25","v":21.75},{"$f":"'Data (HIDE)'!$N$26+'Data (HIDE)'!$O$26+'Data (HIDE)'!$P$26","v":49},{"$f":"'Data (HIDE)'!$N$27+'Data (HIDE)'!$O$27+'Data (HIDE)'!$P$27","v":33.5},{"$f":"'Data (HIDE)'!$N$28+'Data (HIDE)'!$O$28+'Data (HIDE)'!$P$28","v":42.75},{"$f":"'Data (HIDE)'!$N$29+'Data (HIDE)'!$O$29+'Data (HIDE)'!$P$29","v":128.5},{"$f":"'Data (HIDE)'!$N$30+'Data (HIDE)'!$O$30+'Data (HIDE)'!$P$30","v":128.5},{"$f":"'Data (HIDE)'!$N$31+'Data (HIDE)'!$O$31+'Data (HIDE)'!$P$31","v":128.5}]
{"$rows_left_out":71}
{"sheet":"S.O.S.","index":2,"n_rows":194,"n_cols":50,"rows_kept":194,"cut":false,"hidden":false,"merged":[[1,31,1,32],[106,2,106,5],[0,0,0,11],[101,1,102,10],[72,4,72,10],[72,11,72,23],[86,4,86,10],[86,11,86,23],[87,2,87,3],[101,16,102,23],[73,2,73,3],[1,2,1,3],[1,14,1,15],[0,12,0,23]]}
[{"$f":"\"Crop Production Standardized Operating Statement \"&Introduction!I11&\" (Dollars Per Acre)\"","v":"Crop Production Standardized Operating Statement 2025 (Dollars Per Acre)"},null,null,null,null,null,null,null,null,null,null,null,{"$f":"\"Crop Production Standardized Operating Statement \"&Introduction!I11&\" (Dollars Per Acre)\"","v":"Crop Production Standardized Operating Statement 2025 (Dollars Per Acre)"},null,null,null,null,null,null,null,null,null,null,null,null,null,null,"HIDE"]
[null,null,{"$f":"\"Estimated Manitoba \"&Introduction!I11&\" Benchmark\"","v":"Estimated Manitoba 2025 Benchmark"},null,{"$f":"'Data (HIDE)'!$B$16","v":"Wheat - Hard Red Spring"},{"$f":"'Data (HIDE)'!$B$17","v":"Wheat - Northern Hard Red"},{"$f":"'Data (HIDE)'!$B$18","v":"Wheat - Prairie Spring"},{"$f":"'Data (HIDE)'!$B$19","v":"Wheat - Winter"},{"$f":"'Data (HIDE)'!$B$20","v":"Oats"},{"$f":"'Data (HIDE)'!$B$21","v":"Barley"},{"$f":"'Data (HIDE)'!$B$22","v":"Hybrid Fall Rye"},{"$f":"'Data (HIDE)'!$B$23","v":"Corn"},null,null,{"$f":"\"Estimated Manitoba \"&Introduction!U11&\" Benchmark\"","v":"Estimated Manitoba  Benchmark"},null,{"$f":"'Data (HIDE)'!$B$24","v":"Canola"},{"$f":"'Data (HIDE)'!$B$25","v":"Soybeans"},{"$f":"'Data (HIDE)'!$B$26","v":"Sunflower - Oilseed"},{"$f":"'Data (HIDE)'!$B$27","v":"Flaxseed"},{"$f":"'Data (HIDE)'!$B$28","v":"Peas"},{"$f":"'Data (HIDE)'!$B$29","v":"Beans - Pinto"},{"$f":"'Data (HIDE)'!$B$30","v":"Beans - White"},{"$f":"'Data (HIDE)'!$B$31","v":"Beans - Black"},null,null,null,"Estimated Manitoba Benchmark",null,null,null,{"$f":"\"Estimated Manitoba 2024 Benchmark\"","v":"Estimated Manitoba 2024 Benchmark"},null,null,null,null,null,null,null,null,null,null,null,null,null,null,null,null,2021]
[" =","Revenue",550,{"$f":"SUM(C3/C3)","v":1},{"$f":"Summary!C38","v":520},{"$f":"Summary!D38","v":525},{"$f":"Summary!E38","v":525},{"$f":"Summary!F38","v":455},{"$f":"Summary!G38","v":492},{"$f":"Summary!H38","v":360},{"$f":"Summary!I38","v":440},{"$f":"Summary!J38","v":805}," =","Revenue",{"$f":"C3","v":550},{"$f":"D3","v":1},{"$f":"Summary!M38","v":596.25},{"$f":"Summary!N38","v":480},{"$f":"Summary!O38","v":520},{"$f":"Summary!P38","v":400},{"$f":"Summary!Q38","v":481.25},{"$f":"Summary!R38","v":760},{"$f":"Summary!S38","v":697},{"$f":"Summary!T38","v":680},null,null,null,{"$f":"SUM((E3*('Data (HIDE)'!$H$16/SUM('Data (HIDE)'!$H$16+'Data (HIDE)'!$H$24+'Data (HIDE)'!$H$25)))+(Q3*('Data (HIDE)'!$H$24/SUM('Data (HIDE)'!$H$16+'Data (HIDE)'!$H$24+'Data (HIDE)'!$H$25)))+(R3*('Data (HIDE)'!$H$25/SUM('Data (HIDE)'!$H$16+'Data (HIDE)'!$H$24+'Data (HIDE)'!$H$25))))","v":548.01937772796339},{"$f":"SUM(AB3/AB3)","v":1},null,null,645,1,null,null,null,null,null,null,null,null,null,null,null,null,null,null,null,451.48478701717647,{"$f":"SUM(AW3/AW3)","v":1}]
[]
[{"$f":"\" -\"","v":" -"},"Cost of Goods Sold (CoGS)",null,null,null,null,null,null,null,null,null,null,{"$f":"\" -\"","v":" -"},"Cost of Goods Sold (CoGS)",null,null,null,null,null,null,null,null,null,null,null,null,null,"***copy nnum to left",null,null,null,null,null,null,null,null,null,null,null,null,null,null,null,null,null,null,null,null,"***need to hard type the benchmark, from right ***"]
[null,"Seed & Treatment",65,{"$f":"SUM(C6/$C$3)","v":0.11818181818181818},{"$f":"'Data (HIDE)'!$L$16","v":34},{"$f":"'Data (HIDE)'!$L$17","v":34},{"$f":"'Data (HIDE)'!$L$18","v":34},{"$f":"'Data (HIDE)'!$L$19","v":32},{"$f":"'Data (HIDE)'!$L$20","v":25},{"$f":"'Data (HIDE)'!$L$21","v":20},{"$f":"'Data (HIDE)'!$L$22","v":78.400000000000006},{"$f":"'Data (HIDE)'!$L$23","v":100},null,"Seed & Treatment",{"$f":"C6","v":65},{"$f":"D6","v":0.11818181818181818},{"$f":"'Data (HIDE)'!$L$24","v":82.5},{"$f":"'Data (HIDE)'!$L$25","v":90},{"$f":"'Data (HIDE)'!$L$26","v":50},{"$f":"'Data (HIDE)'!$L$27","v":56},{"$f":"'Data (HIDE)'!$L$28","v":85},{"$f":"'Data (HIDE)'!$L$29","v":105},{"$f":"'Data (HIDE)'!$L$30","v":110},{"$f":"'Data (HIDE)'!$L$31","v":115},null,null,null,{"$f":"SUM((E6*('Data (HIDE)'!$H$16/SUM('Data (HIDE)'!$H$16+'Data (HIDE)'!$H$24+'Data (HIDE)'!$H$25)))+(Q6*('Data (HIDE)'!$H$24/SUM('Data (HIDE)'!$H$16+'Data (HIDE)'!$H$24+'Data (HIDE)'!$H$25)))+(R6*('Data (HIDE)'!$H$25/SUM('Data (HIDE)'!$H$16+'Data (HIDE)'!$H$24+'Data (HIDE)'!$H$25))))","v":65.659309554824546},{"$f":"SUM(AB6/$AB$3)","v":0.1198120216606972},null,null,65,0.10077519379844961,null,null,null,null,null,null,null,null,null,null,null,null,null,null,null,57.600121726227634,{"$f":"SUM(AW6/$AB$3)","v":0.10510599454536133}]
{"$rows_left_out":189}
{"sheet":"Risk Analysis","index":3,"n_rows":158,"n_cols":33,"rows_kept":158,"cut":false,"hidden":false,"merged":[[20,0,20,9],[20,10,20,20],[73,10,73,20],[0,0,0,9],[0,10,0,20],[85,0,86,9],[77,0,77,1],[81,0,81,1],[73,0,73,9],[148,4,148,5],[89,9,89,18],[100,0,100,1],[146,4,146,5],[104,0,104,1],[85,11,86,20],[155,4,155,5],[156,4,156,5],[157,4,157,5],[146,9,146,10],[147,9,147,10],[148,9,148,10],[155,9,155,10],[156,9,156,10],[157,9,157,10],[147,4,147,5]]}
[{"$f":"IF('Data (HIDE)'!B13=\"Manitoba\",\"AgriInsurance Analysis\",\"AgriInsurance Analysis - \"&'Data (HIDE)'!B13)","v":"AgriInsurance Analysis"},null,null,null,null,null,null,null,null,null,{"$f":"IF('Data (HIDE)'!B13=\"Manitoba\",\"AgriInsurance Analysis\",\"AgriInsurance Analysis - \"&'Data (HIDE)'!B13)","v":"AgriInsurance Analysis"}]
[]
[null,{"$f":"\"*Based on \"&'Data (HIDE)'!B123&\"*\"","v":"*Based on 2024 MASC data*"},{"$f":"'Data (HIDE)'!$B$16","v":"Wheat - Hard Red Spring"},{"$f":"'Data (HIDE)'!$B$17","v":"Wheat - Northern Hard Red"},{"$f":"'Data (HIDE)'!$B$18","v":"Wheat - Prairie Spring"},{"$f":"'Data (HIDE)'!$B$19","v":"Wheat - Winter"},{"$f":"'Data (HIDE)'!$B$20","v":"Oats"},{"$f":"'Data (HIDE)'!$B$21","v":"Barley"},{"$f":"'Data (HIDE)'!$B$22","v":"Hybrid Fall Rye"},{"$f":"'Data (HIDE)'!$B$23","v":"Corn"},null,null,null,{"$f":"'Data (HIDE)'!$B$24","v":"Canola"},{"$f":"'Data (HIDE)'!$B$25","v":"Soybeans"},{"$f":"'Data (HIDE)'!$B$26","v":"Sunflower - Oilseed"},{"$f":"'Data (HIDE)'!$B$27","v":"Flaxseed"},{"$f":"'Data (HIDE)'!$B$28","v":"Peas"},{"$f":"'Data (HIDE)'!$B$29","v":"Beans - Pinto"},{"$f":"'Data (HIDE)'!$B$30","v":"Beans - White"},{"$f":"'Data (HIDE)'!$B$31","v":"Beans - Black"}]
[]
["AgriInsurance ",null,null,null,null,null,null,null,null,null,null,"AgriInsurance "]
[null,{"$f":"'Data (HIDE)'!B14","v":"80% Insured Value"},{"$f":"'Data (HIDE)'!$AO$16","v":471.45000000000005},{"$f":"'Data (HIDE)'!$AO$17","v":453.83279999999996},{"$f":"'Data (HIDE)'!$AO$18","v":455.06700000000006},{"$f":"'Data (HIDE)'!$AO$19","v":393.43199999999996},{"$f":"'Data (HIDE)'!$AO$20","v":420.90400000000011},{"$f":"'Data (HIDE)'!$AO$21","v":368.01060000000001},{"$f":"'Data (HIDE)'!$AO$22","v":355.0976},{"$f":"'Data (HIDE)'!$AO$23","v":701.36640000000011},null,{"$f":"'Data (HIDE)'!B14","v":"80% Insured Value"},null,{"$f":"'Data (HIDE)'!$AO$24","v":604.66320000000019},{"$f":"'Data (HIDE)'!$AO$25","v":421.06400000000002},{"$f":"'Data (HIDE)'!$AO$26","v":387.26400000000001},{"$f":"'Data (HIDE)'!$AO$27","v":255.67380000000003},{"$f":"'Data (HIDE)'!$AO$28","v":371.84400000000005},{"$f":"'Data (HIDE)'!$AO$29","v":737.2},{"$f":"'Data (HIDE)'!$AO$30","v":683.7},{"$f":"'Data (HIDE)'!$AO$31","v":697.26800000000003}]
{"$rows_left_out":153}
{"sheet":"Charts","index":4,"n_rows":22,"n_cols":5,"rows_kept":22,"cut":false,"hidden":false,"merged":[]}
[]
[]
[]
[]
[]
[]
{"$rows_left_out":17}
{"sheet":"Seed, Fertilizer & Chemical","index":5,"n_rows":115,"n_cols":46,"rows_kept":115,"cut":false,"hidden":false,"merged":[[89,0,89,16],[23,0,23,16],[0,0,0,16],[55,1,56,14],[34,2,34,12],[35,2,35,3],[35,5,35,6],[35,8,35,9],[35,11,35,12],[58,1,60,14]]}
["Seed & Treatment"]
[null,null,null,"Seeding Rate",null,null,"Price",null,null,"Cost"]
["Crop",null,null,"per Acre",null,null,"per Unit",null,null,"per Acre"]
[null,"Wheat - Hard Red Spring",null,2,"bu",null,17,"/bu",null,{"$f":"ROUND(D4*G4,2)","v":34}]
[null,"Wheat - Northern Hard Red",null,2,"bu",null,17,"/bu",null,34]
[null,"Wheat - Prairie Spring",null,2,"bu",null,17,"/bu",null,34]
{"$rows_left_out":110}
{"sheet":"Op. Cost Input","index":6,"n_rows":53,"n_cols":29,"rows_kept":53,"cut":false,"hidden":false,"merged":[[0,0,0,13],[34,4,35,4],[34,5,35,5],[34,6,35,6],[34,7,35,7],[34,8,35,8],[34,9,35,9],[31,0,31,13],[10,8,10,13],[9,4,9,13],[34,10,35,10],[34,11,35,11],[34,12,35,12],[34,13,35,13],[33,12,33,13],[33,4,33,11]]}
["Operating Costs"]
[]
[null,"Interest Rate on Operating",null,7.4999999999999997E-2,null,null,"Grain Hauling",null,null,null,null,null,null,null,null,null,null,"# Hired","# of","Acres","Hours "]
[null,"Land Taxes  ($/acre)",null,20,null,null,"  Distance to storage",null,6,"miles roundtrip",null,null,null,null,null,null,null,"Staff","Months","Farmed","Per Acre"]
[null,"Labour rate ($/hour)",null,27,null,null,"  Distance to market",null,45,"miles roundtrip",null,null,null,null,null,null,null,1,12,{"$f":"'Fixed Cost Input'!D5+'Fixed Cost Input'!D6","v":2500},{"$f":"SUM(R5*S5*4*40)/T5","v":0.76800000000000002}]
[null,"Machinery Operating  ($/acre)",null,25,null,null,"  Grain truck fuel use",null,5,"Miles per Imp. Gallon",null,null,null,null,null,null,null,2,4,{"$f":"T5","v":2500},{"$f":"SUM(R6*S6*4*40)/T6","v":0.51200000000000001}]
{"$rows_left_out":48}
{"sheet":"Fixed Cost Input","index":7,"n_rows":67,"n_cols":20,"rows_kept":67,"cut":false,"hidden":false,"merged":[[0,0,0,9],[21,0,21,9],[49,0,49,9],[57,0,57,9]]}
["Fixed Costs"]
[]
[null,"Land",null,null,null,null,null,null,"Conventional","Special"]
[null,"  Average Land value ($/acre)",null,4500,null,null,"Machinery",null,"Crop","Crop",null,"*HIDE*"]
[null,"  Conventional Crop acres",null,2000,null,null,"  Total Investment ($/acre)",null,{"$f":"ROUND((C48)/(D5+D6),2)","v":650},{"$f":"ROUND((C56)/(D6+D5),2)","v":145},null,{"$f":"(C56-J55)/(D6+D5)","v":116}]
[null,"  Special Crop acres",null,500,null,null,"  Residual Value (End of Useful Life)",null,0.25]
{"$rows_left_out":62}
{"sheet":"Assumptions","index":8,"n_rows":61,"n_cols":4,"rows_kept":61,"cut":false,"hidden":false,"merged":[[13,0,13,11],[15,0,15,11],[0,0,0,11],[8,0,9,11],[44,0,45,11],[20,0,21,11],[26,0,28,11],[4,0,5,11]]}
["Other Assumptions"]
[]
["Fuel Costs:  Includes fuel used for field work, trucking in inputs and trucking out production."]
[]
["Machinery  Operating Costs:  Includes costs for maintenance, repairs, licenses and insurance, based on 4.2% of machinery investment cost."]
[]
{"$rows_left_out":56}
{"sheet":"Data (HIDE)","index":9,"n_rows":252,"n_cols":90,"rows_kept":252,"cut":false,"hidden":true,"merged":[[93,2,93,3],[93,4,93,5],[93,6,93,7],[93,8,93,9]]}
[null,"Annual Update Steps:",null,null,null,null,null,null,null,null,null,"To Do List:"]
[null,"copy & paste 'Green' data blocks below from annual MASC cost and coverage information spreadsheet."]
[null,"enter COP yields into 'yellow' data block below",null,null,null,null,null,null,null,null,null,null,null,null,null,null,null,null,null,null,null,null,null,null,null,null,null,null,null,null,null,null,null,null,null,null,null,null,null,null,null,null,null,null,null,null,null,null,null,null,null,null,null,null,null,null,null,null,null,null,null,{"$f":"V14&\" Yield per Acre - \"&Introduction!I11","v":"Manitoba Yield per Acre - 2025"}]
[null,"enter MASC insured values & COP yields into 'yellow' data blocks below",null,null,null,null,null,null,null,null,null,null,null,null,null,null,null,null,null,null,null,null,null,null,null,null,null,null,null,null,null,null,null,null,null,null,null,null,null,null,null,null,null,null,null,null,null,null,null,null,null,null,null,null,null,null,null,null,null,null,null,null,"Return on Investment (ROI) = (Gross Revenue - Total Cost) / Total Cost "]
[null,"enter MASC SAR acres into data block below and change formula for 5 year average.",null,null,null,null,null,null,null,null,null,null,null,null,null,null,null,null,null,null,null,null,null,null,null,null,null,null,null,null,null,null,null,null,null,null,null,null,null,null,null,null,null,null,null,null,null,null,null,null,null,null,null,null,null,null,null,null,null,null,null,null,"Return on Operating (ROO) = (Gross Revenue - Operating Cost) / Operating Cost"]
[null,"select yellow rows and sort",null,null,null,null,null,null,null,null,null,null,null,null,null,null,null,null,null,null,null,null,null,null,null,null,null,null,null,null,null,null,null,null,null,null,null,null,null,null,null,null,null,null,null,null,null,null,null,null,null,null,null,null,null,null,null,null,null,null,null,null,"Profit Efficiency Ratio = (Gross Revenue - Operating Cost) / Operating Cost"]
{"$rows_left_out":247}
{"sheet":"Weekly Bushels (HIDE)","index":10,"n_rows":703,"n_cols":40,"rows_kept":703,"cut":false,"hidden":true,"merged":[[0,1,0,4],[0,8,0,10],[0,12,0,15],[0,17,0,24],[0,26,0,39]]}
["SOURCE","Open Market (CAD/Bushels)",null,null,null,null,null,null,"Closing Futures Prices",null,null,null,"Cash Prices",null,null,null,null,"US Futures Prices",null,null,null,null,null,null,null,null,"Additional Data from CWB MRS (FOB USD)"]
[null,"CWRS Wheat","Canola","#2CW Oats","Soybeans","Peas","Corn",null,"ICE Milling Wheat","ICE Western Barley","ICE Canola",null,"Feed Wheat Track Thunder Bay","Feed Barley Lethbridge","Canola Thunder Bay","Canola Vancouver",null,"SRW Wheat","Corn","Oats","Soybeans","Soyoil (cents/lb)","Soymeal","HRW Wheat","HRS Wheat",null,"2 CWRS 13.5 TB","2 CWRS 13.0 TB","2 CWRS 13.5 SL","2 CWRS 13.0 SL","2 CWRS 13.5 Van","2 CWRS 13.0 Van","Canola Van","CWRS WCEI (NTN) (CAD)","CWRW WCEI (NTN) (CAD)","Feed Barley WCEI (NTN) (CAD)","Canola WCEI (NTN) (CAD)","Soybeans WCEI (NTN) (CAD)",null,"CWB less ICE"]
["2011-08-05",null,12.286809398530346,3.1039534560932727,11.323806076506541,null,null,null,null,4.4633526092106175,12.68937675768847,null,6.3412231212425541,4.3109454469448893,13.36977229429375,12.91617526989023,null,6.8168134945582519,6.9378524436090219,3.3149999999999999,13.39115140826863,1216.7190000000001,null,7.7092236220086718,8.2316710075468738]
["2011-08-12",null,12.104191236505489,3.2993533512229729,11.157177965202198,null,null,null,null,4.4633526092106175,12.426290483534428,null,6.3412231212425541,4.2456280916881486,12.539689739635309,12.902567359158123,null,7.0117938585390158,7.0253568888437306,3.44,13.336156946633031,1191.3615,null,8.0791863639208916,8.6241314837645646]
["2011-08-19",null,12.01029665245396,3.254280250454952,11.331803456556273,null,null,null,null,4.3327178986971369,12.553297650367414,null,6.3412231212425541,4.1367658329269146,12.780096162569174,12.893495418670055,null,7.0767873131992705,6.9903551107498476,3.4249999999999998,13.518638569332976,1218.7035000000001,null,7.9491994546003815,9.1065828972041469]
["2011-08-26",null,12.19178082191781,3.5338806637673112,11.838449584554633,null,null,null,null,4.3762628022016301,12.743808400616892,null,6.3412231212425541,4.1367658329269146,12.970606912818651,13.084006168919531,null,7.5717374679196716,7.3228720026417378,3.68,13.858604332171231,1225.98,null,8.4766463366509086,9.3465587297958574]
{"$rows_left_out":698}
{"sheet":"Chart data (HIDE)","index":11,"n_rows":268,"n_cols":48,"rows_kept":268,"cut":false,"hidden":true,"merged":[[43,0,43,1],[44,0,44,1],[18,4,18,5],[0,0,0,1],[1,0,1,1],[18,2,18,3],[34,1,34,3],[34,4,34,6]]}
["MASC - 5 Year Average Seeded Acres"]
[{"$f":"\"MASC - \"&Introduction!I11-1&\" Seeded Acres\"","v":"MASC - 2024 Seeded Acres"},null,"(change reference in 'C' formulas to current year in data)"]
[null,"5 yr Average Acres",{"$f":"'Data (HIDE)'!J15","v":"2024 Acres"}]
[{"$f":"'Data (HIDE)'!B67","v":"Canola"},{"$f":"'Data (HIDE)'!C67","v":3292975},{"$f":"'Data (HIDE)'!Q67","v":3264557}]
[{"$f":"'Data (HIDE)'!B68","v":"Wheat - Hard Red Spring"},{"$f":"'Data (HIDE)'!C68","v":2693718.2},{"$f":"'Data (HIDE)'!Q68","v":2710917}]
[{"$f":"'Data (HIDE)'!B69","v":"Soybeans"},{"$f":"'Data (HIDE)'!C69","v":1225326.2},{"$f":"'Data (HIDE)'!Q69","v":1308262},{"$f":"SUM(C4:C6)","v":7283736}]
{"$rows_left_out":263}
{"sheet":"COP (HIDE)","index":12,"n_rows":81,"n_cols":30,"rows_kept":81,"cut":false,"hidden":true,"merged":[[78,0,79,10]]}
[]
[". . . . . . . . . . . . . . . . . . . . . . . . . . . . . . . . . . . . . . . . . . . "]
["Crop Production Cost Calculator",null,null,null,null,null,null,"Printed:",{"$f":"TODAY()","v":"2024-12-06"}]
[null,null,null,null,"*** Enter changes to BLUE values only ***"]
["Crop Production Costs (Dollars Per Acre)"]
[null,null,null,{"$f":"'Data (HIDE)'!$B$24","v":"Canola"},{"$f":"'Data (HIDE)'!$B$16","v":"Wheat - Hard Red Spring"},{"$f":"'Data (HIDE)'!$B$25","v":"Soybeans"},{"$f":"'Data (HIDE)'!$B$20","v":"Oats"},{"$f":"'Data (HIDE)'!$B$23","v":"Corn"},"Enter Crop","Enter Crop","Enter Crop"]
{"$rows_left_out":75}