{"text_format":"1","workbook":"xlsx","n_sheets":9,"sheets":["Introduction","Assumptions","Farrow-Finish Summary","Risk Analysis","Farrow Input","Fixed Cost","Ingredient-Summary","Finish-O","Weaner-O"],"not_rendered":{"charts":0,"images":3,"macros":1,"external_links":0,"defined_names":76,"comments":1,"pivot_tables":0},"unopened":[],"bounds":{"document_bytes":16777216,"sheet_cells":100000,"rows_first":2000,"rows_last":500,"rows_between":2000,"halvings":0,"cell_chars":16384,"cell_head_chars":4096},"cells_cut":0,"cells_raw":0,"read":"whole","date_system":"1900"}

{"sheet":"Introduction","index":0,"n_rows":83,"n_cols":8,"rows_kept":83,"cut":false,"hidden":false,"merged":[[4,1,4,8],[5,1,5,8],[6,1,6,8],[57,1,57,8],[7,1,7,8],[17,1,24,8],[25,1,35,8],[53,1,55,8]]}
[]
[]
[". . . . . . . . . . . . . . . . . . . . . . . . . . . . . . . . . . . . . . . . . . . . . . . . . "]
[]
[null,"Guidelines For Estimating"]
[null,"Swine Farrow-Finish Costs"]
[null,{"$f":"\"Based On \"&'Farrow Input'!G13&\" Sows and \"&FIXED('Farrow Input'!F83,0)&\" Pigs Sold\"","v":"Based On 500 Sows and 13,033 Pigs Sold"}]
[]
[]
[]
[]
[null,null,null,null,null,null,"Date:","June, 2025"]
[]
[]
[]
[]
[]
[null,"This guide is designed to provide you with planning information and a format for calculating costs of production of a swine farrow to finish enterprise  in Manitoba.  General Manitoba Agriculture recommendations are assumed in using feed and veterinary inputs. These figures provide an economic evaluation of the livestock and estimated prices required to cover all costs.  Costs include labour, investment and depreciation, but do not include management costs, nor do they necessarily represent the average cost of production in Manitoba."]
[]
[]
{"$rows_left_out":64}
{"sheet":"Assumptions","index":1,"n_rows":26,"n_cols":2,"rows_kept":26,"cut":false,"hidden":false,"merged":[[20,1,23,7],[25,1,30,7],[1,1,1,7],[10,1,13,7],[15,1,18,7],[3,1,8,7]]}
[]
[null,"Farrow-Finish Pig Cost of Production"]
[]
[null,{"$f":"\"The following farrow to finish budget is based on the assumption that all feed is purchased or home-mixed. The budget includes a land investment cost for \"&'Fixed Cost'!D33&\" acres, with \"&'Fixed Cost'!C46&\" acres rented out at $\"&'Fixed Cost'!C47&\" per acre, of the estimated \"&ROUND(((('Farrow Input'!C162*'Farrow Input'!H164)/(40.768*2))*2.4709661),0)&\" to \"&ROUND(((('Farrow Input'!C162*'Farrow Input'!H164)/(26.362*2))*2.4709661),0)&\" acres of total landbase that would be required for this size of livestock operation.  This land base falls within the 2XP2O5 application rate, soil phosphorus levels permitting.\"","v":"The following farrow to finish budget is based on the assumption that all feed is purchased or home-mixed. The budget includes a land investment cost for 40 acres, with 0 acres rented out at $100 per acre, of the estimated 233 to 361 acres of total landbase that would be required for this size of livestock operation.  This land base falls within the 2XP2O5 application rate, soil phosphorus levels permitting."}]
[]
[]
[]
[]
[]
[]
[null,"The budget includes an assumption that 1.75% of the market pigs are sold as lightweight pigs. It is assumed that when the lightweight pigs are sold, they will have a salvage value. Therefore, total marketings are reduced by only 1% to compensate for the lightweight pigs. "]
[]
[]
[]
[]
[null,"The budget includes an assumption that this particular operation is \"all-in, all-out\" by  room. Space allocations for finishing pigs are in accordance with the Recommended Code of Practice for the Care and Handling of Farm Animals: Pigs."]
[]
[]
[]
[]
{"$rows_left_out":7}
{"sheet":"Farrow-Finish Summary","index":2,"n_rows":71,"n_cols":9,"rows_kept":71,"cut":false,"hidden":false,"merged":[[1,4,1,6],[0,0,0,8],[70,0,71,8],[45,0,45,8]]}
[{"$f":"'Farrow Input'!G13&\" Sow Farrow-Finish Cost of Production Summary - \"&Introduction!H12","v":"500 Sow Farrow-Finish Cost of Production Summary - June, 2025"}]
[null,null,null,null,"Purchased Feed"]
[null,null,null,null,"$/Pig","$/Sow","Total",null,"Your "]
["A. Operating Costs",null,null,null,"Sold","/Year","Cost",null,"Cost"]
["1.","Feed Costs:"]
[null,"Sow Lactation ",null,null,{"$f":"'Farrow Input'!G56","v":5.997504127982813},{"$f":"E6*'Farrow Input'!$G$83","v":156.33094259999999},{"$f":"E6*'Farrow Input'!$F$83","v":78165.471300000005}]
[null,"Sow Gestation ",null,null,{"$f":"'Farrow Input'!F56","v":14.938251783933092},{"$f":"E7*'Farrow Input'!$G$83","v":389.38047099999994},{"$f":"E7*'Farrow Input'!$F$83","v":194690.23549999998}]
[null,"Boar Ration",null,null,{"$f":"'Farrow Input'!H56","v":9.8929948352367791E-2},{"$f":"E8*'Farrow Input'!$G$83","v":2.5787080337528185},{"$f":"E8*'Farrow Input'!$F$83","v":1289.3540168764093}]
[null,"Pre Starter 1",null,null,{"$f":"'Farrow Input'!E44","v":1.5250261336607078},{"$f":"E9*'Farrow Input'!$G$83","v":39.75133120000001},{"$f":"E9*'Farrow Input'!$F$83","v":19875.665600000004}]
[null,"Pre Starter 2",null,null,{"$f":"'Farrow Input'!F44","v":4.2185222128443183},{"$f":"E10*'Farrow Input'!$G$83","v":109.96},{"$f":"E10*'Farrow Input'!$F$83","v":54980}]
[null,"Starter 1",null,null,{"$f":"'Farrow Input'!G44","v":10.378935663316197},{"$f":"E11*'Farrow Input'!$G$83","v":270.53733699999998},{"$f":"E11*'Farrow Input'!$F$83","v":135268.6685}]
[null,"Starter 2",null,null,{"$f":"'Farrow Input'!H44","v":11.380518299700761},{"$f":"E12*'Farrow Input'!$G$83","v":296.64458999999999},{"$f":"E12*'Farrow Input'!$F$83","v":148322.29500000001}]
[null,"Starter",null,null,{"$f":"'Farrow Input'!F96","v":17.13},{"$f":"E13*'Farrow Input'!$G$83","v":446.51057999999995},{"$f":"E13*'Farrow Input'!$F$83","v":223255.28999999998}]
[null,"Grower ",null,null,{"$f":"'Farrow Input'!G96","v":76.260000000000005},{"$f":"E14*'Farrow Input'!$G$83","v":1987.7931599999999},{"$f":"E14*'Farrow Input'!$F$83","v":993896.58000000007}]
["","Finisher ",null,null,{"$f":"'Farrow Input'!H96","v":41.99},{"$f":"E15*'Farrow Input'!$G$83","v":1094.51134},{"$f":"E15*'Farrow Input'!$F$83","v":547255.67000000004}]
["Total Feed Cost",null,null,null,{"$f":"SUM(E6:E15)","v":183.91768816979027},{"$f":"SUM(F6:F15)","v":4793.9984598337523},{"$f":"SUM(G6:G15)","v":2396999.2299168766}]
[]
["2.","Other Operating Costs:",null,null,null,""]
[null,"Veterinary Medicine & Supplies",null,null,{"$f":"'Farrow Input'!C118+'Farrow Input'!C122","v":5.3709813550218675},{"$f":"E19*'Farrow Input'!$G$83","v":140},{"$f":"E19*'Farrow Input'!$F$83","v":70000}]
[null,"Maintenance & Repairs",null,null,{"$f":"'Farrow Input'!C128","v":5.905481555538505},{"$f":"E20*'Farrow Input'!$G$83","v":153.93228222666667},{"$f":"E20*'Farrow Input'!$F$83","v":76966.141113333331}]
{"$rows_left_out":52}
{"sheet":"Risk Analysis","index":3,"n_rows":49,"n_cols":5,"rows_kept":49,"cut":false,"hidden":false,"merged":[[0,0,0,6],[48,0,50,6]]}
["Risk & Sensitivity Analysis"]
[]
[null,null,"Purchased Feed"]
[null,null,"Per Pig"]
["A.  Operating Costs"]
[null,"Feed cost",{"$f":"'Farrow-Finish Summary'!E16","v":183.91768816979027}]
[null,"Other Operating Costs",{"$f":"SUM(C8-C6)","v":40.515148304517965}]
[null,"Subtotal",{"$f":"'Farrow-Finish Summary'!E31","v":224.43283647430823}]
["B.  Fixed Costs",null,{"$f":"'Farrow-Finish Summary'!E38","v":57.705631094343737}]
["C.  Labour",null,{"$f":"'Farrow-Finish Summary'!E43","v":17.236246451315889}]
["Total Costs",null,{"$f":"SUM(C8:C10)","v":299.37471401996783}]
[]
["Estimated Farmgate"]
[null,"Price ($ per 100kg)",{"$f":"'Farrow-Finish Summary'!E49","v":277}]
[]
[]
[null,null,"Up",null,"Down"]
[null,"Percent Market Price Variation",0.1,null,0.1]
[null,"Percent Feed Cost Variation",0.1,null,0.05]
[]
{"$rows_left_out":30}
{"sheet":"Farrow Input","index":4,"n_rows":247,"n_cols":9,"rows_kept":247,"cut":false,"hidden":false,"merged":[[1,0,1,10],[10,0,10,10],[57,0,57,10],[74,1,74,10],[75,1,75,10]]}
[]
["Farrow - Finish Pig Production Costs"]
[]
[1," This input table outlines the cost of production for a farrow finish operation."]
[2," Buildings and equipment are valued at new cost."]
[3," Purchased feed is used.  "]
[4," Manure haulage is contracted out."]
[5," Gilts are purchased for herd replacement."]
[6," No weaner pigs are sold."]
[]
["Farrow - Wean Pig Production Assumptions"]
["Indicators of Productivity"]
[null,"Sows",null,null,null,null,500,300,"/sow"]
[null,"Boars",null,null,null,null,3,3000,"/boar"]
[null,"Litters/Sow/Year",null,null,null,null,2.38]
[null,"Average Weaning Age (days)",null,null,null,null,21]
[null,"Average Born Alive per Litter",null,null,null,null,13.9]
[null,"Percent Pre-Weaning Mortality",null,null,null,null,14.5]
[null,"Percent Post-Weaning Mortality",null,null,null,null,2.8]
[]
{"$rows_left_out":228}
{"sheet":"Fixed Cost","index":5,"n_rows":70,"n_cols":12,"rows_kept":70,"cut":false,"hidden":false,"merged":[[0,0,0,9],[55,0,56,9]]}
["Fixed Costs"]
[]
[null,"Pig Places1"]
[null,"Gestation",{"$f":"'Farrow Input'!G13","v":500},27,"ft.2 per Pig Place",null,{"$f":"D4*C4","v":13500},"ft.2 Total"]
[null,"Farrowing/Nursing",{"$f":"'Farrow Input'!E24","v":1190},15,"ft.2 per Pig Place",null,17850,"ft.2 Total"]
[null,"Feeder",{"$f":"'Farrow Input'!E29/3","v":4582.333333333333},9.1999999999999993,"ft.2 per Pig Place",null,{"$f":"D6*C6","v":42157.46666666666},"ft.2 Total"]
[]
[]
["Buildings",null,"$/pig place","Total",null,"Barn Equipment",null,"$/pig place","Total"]
[null,"  Gestation",1750,{"$f":"C10*$C$4","v":875000},{"$f":"\"($\"&ROUND((C10*$C$4)/$G$4,0)&\"/sq.ft.) \"","v":"($65/sq.ft.) "},null,"Gestation",700,{"$f":"H10*$C$4","v":350000},{"$f":"\"($\"&ROUND((H10*$C$4)/$G$4,0)&\"/sq.ft.) \"","v":"($26/sq.ft.) "}]
[null,"  Farrowing/Nursing",1150,{"$f":"C11*$C$5","v":1368500},{"$f":"\"($\"&ROUND((C11*$C$5)/$G$5,0)&\"/sq.ft.) \"","v":"($77/sq.ft.) "},null,"Farrowing/Nursing",400,{"$f":"H11*$C$5","v":476000},{"$f":"\"($\"&ROUND((H11*$C$5)/$G$5,0)&\"/sq.ft.) \"","v":"($27/sq.ft.) "}]
[null,"  Feeder Barn Cost ",460,{"$f":"C12*$C$6","v":2107873.333333333},{"$f":"\"($\"&SUM(C12*$C$6)/$G$6&\"/sq.ft.) \"","v":"($50/sq.ft.) "},null,"Finishing Barn",120,{"$f":"H12*$C$6","v":549880},{"$f":"\"($\"&ROUND((H12*$C$6)/$G$6,0)&\"/sq.ft.) \"","v":"($13/sq.ft.) "}]
[null,"  Office and Loading (300 sq.ft.)",30,{"$f":"C13*$C$4","v":15000},{"$f":"\"($\"&ROUND((C13*$C$4)/300,0)&\"/sq.ft.) \"","v":"($50/sq.ft.) "},null,"Other",0,{"$f":"H13*$C$6","v":0},null,null,"*HIDE*"]
[null,"  Manure Storage",240,{"$f":"C14*$C$4","v":120000},null,null,"Fire Alarm System",6,{"$f":"H14*$C$4","v":3000},null,null,{"$f":"(#REF!-#REF!)/(#REF!+D33)","v":{"$error":"#REF!"}}]
[null,"  Standby Generator",56,{"$f":"C15*$C$4","v":28000},null,null,"Storage Bins",5.94,{"$f":"H15*$C$6","v":27219.06}]
[null,"Total Barn Cost",null,{"$f":"SUM(D10:D15)","v":4514373.333333333},null,null,"Total Equipment Cost",null,{"$f":"SUM(I10:I15)","v":1406099.06}]
[]
[null,"  Residual Value (End of Useful Life)",null,0.5,null,null,"  Residual Value (End of Useful Life)",null,0.1]
[null,"  Useful Life (years)",null,25,null,null,"  Useful Life (years)",null,10]
[null,"  Owned Barn Equity",null,0.25,null,null,"  Owned Barn Equipment Equity",null,0.25]
{"$rows_left_out":51}
{"sheet":"Ingredient-Summary","index":6,"n_rows":20,"n_cols":8,"rows_kept":20,"cut":false,"hidden":false,"merged":[[0,1,0,8]]}
[null,"  Summary of Purchased Feeds Used"]
[]
[null,null,"Farrow finish ",null,{"$f":"'Farrow Input'!G13","v":500},"sows"]
[null,null,"Total sold",null,{"$f":"'Farrow Input'!F83","v":13033},"pigs sold"]
[]
[null,null,null,null,"Total","Total","Total","Total"]
[null,null,null,null,"per Year","per Month","per Pig","per Pig"]
[null,null,null,null,"(tonnes)","(tonnes)","(kgs)","(lbs)"]
[]
[null,"Sow Lactation ",null,null,{"$f":"IF('Farrow Input'!F52<=0,0,(('Farrow Input'!F51*'Farrow Input'!F50)*E3)/1000)","v":464.65449999999998},{"$f":"E10/12","v":38.72120833333333},{"$f":"E10/$E$4*1000","v":35.652152228957263},{"$f":"G10*2.2046","v":78.598734803959189}]
[null,"Sow Gestation ",null,null,{"$f":"IF('Farrow Input'!G52<=0,0,(('Farrow Input'!G51*'Farrow Input'!G50)*E3)/1000)","v":163.18469999999999},13.598725,12.520885444640527,27.603544051254506]
[null,"Boar Ration",null,null,{"$f":"IF('Farrow Input'!H52<=0,0,(('Farrow Input'!H51*'Farrow Input'!H50)*'Farrow Input'!E23)/1000)","v":3.2850000000000001},0.27374999999999999,0.25205248216066911,0.55567490217141113]
[null,"Pre Starter 1",null,null,{"$f":"IF('Farrow Input'!E40<=0,0,('Farrow Input'!E37*'Farrow Input'!E27)/1000)","v":11.314400000000001},0.94286666666666674,0.86813473490370607,1.9138898365687105]
[null,"Pre Starter 2",null,null,{"$f":"IF('Farrow Input'!F40<=0,0,('Farrow Input'!F37*'Farrow Input'!E27)/1000)","v":56.572000000000003},4.7143333333333333,4.3406736745185306,9.5694491828435524]
[null,"Starter 1",null,null,{"$f":"IF('Farrow Input'!G40<=0,0,('Farrow Input'!G37*'Farrow Input'!E27)/1000)","v":168.30170000000001},14.025141666666668,12.913504181692627,28.469111318959566]
[null,"Starter 2",null,null,{"$f":"IF('Farrow Input'!H40<=0,0,('Farrow Input'!H37*'Farrow Input'!E27)/1000)","v":233.3595},19.446625000000001,17.905278907388936,39.473977879229651]
[null,"Starter",null,null,{"$f":"IF('Farrow Input'!F92<=0,0,('Farrow Input'!F89*'Farrow Input'!F64)/1000)","v":192.458},16.038166666666665,14.766976137497123,32.555275592726161]
[null,"Grower ",null,null,{"$f":"IF('Farrow Input'!G92<=0,0,('Farrow Input'!G89*'Farrow Input'!G64)/1000)","v":748.90219249999996},62.408516041666665,57.46199589503567,126.68071615019565]
[null,"Finisher ",null,null,{"$f":"IF('Farrow Input'!H92<=0,0,('Farrow Input'!H89*'Farrow Input'!H64)/1000)","v":377.63733466899998},31.469777889083332,28.975472620962172,63.879326940173208]
[null,"Total",null,null,{"$f":"SUM(E10:E19)","v":2419.6693271690001},{"$f":"SUM(F10:F19)","v":201.63911059741667},{"$f":"SUM(G10:G19)","v":185.65712630775724},{"$f":"SUM(H10:H19)","v":409.29970065808163}]
{"$rows_left_out":1}
{"sheet":"Finish-O","index":7,"n_rows":60,"n_cols":11,"rows_kept":60,"cut":false,"hidden":true,"merged":[]}
[]
[]
[null,"============================================================================="]
[null,"","","GROWING AND FINISHING PIG PRODUCTION SUMMARY"]
[null,"","","",null,"","","","","",""]
[null,"============================================================================="]
[null,"A. OPERATING COSTS",null,null,null,null,"","","TOTAL","$/HOG SOLD","$/PLACE"]
[null,"","1.","Feed Costs:",null,null,null,"","-----------------------------------------------------------------------"]
[null,"","","1.01","Grower Ration #1",null,null,null,{"$f":"J9*'Farrow Input'!F83","v":{"$error":"#REF!"}},{"$f":"ROUND('Farrow Input'!F89*SUM('Farrow Input'!#REF!)/1000,2)","v":{"$error":"#REF!"}},{"$f":"J9*'Farrow Input'!F83/'Farrow Input'!I74","v":{"$error":"#REF!"}}]
[null,null,null,"1.02","Grower Ration #2",null,null,null,{"$f":"J10*'Farrow Input'!F83","v":{"$error":"#REF!"}},{"$f":"ROUND('Farrow Input'!G89*SUM('Farrow Input'!#REF!)/1000,2)","v":{"$error":"#REF!"}},{"$f":"J10*'Farrow Input'!F83/'Farrow Input'!I74","v":{"$error":"#REF!"}}]
[null,"","","1.02","Finisher Ration",null,null,null,{"$f":"J11*'Farrow Input'!F83","v":{"$error":"#REF!"}},{"$f":"ROUND('Farrow Input'!H89*SUM('Farrow Input'!#REF!)/1000,2)","v":{"$error":"#REF!"}},{"$f":"J11*'Farrow Input'!F83/'Farrow Input'!I74","v":{"$error":"#REF!"}}]
[null,"","","","",null,null,null,"=================================================="]
[null,"","","Total Feed Cost",null,null,null,null,{"$f":"SUM(I9:I12)","v":{"$error":"#REF!"}},{"$f":"SUM(J9:J12)","v":{"$error":"#REF!"}},{"$f":"SUM(K9:K12)","v":{"$error":"#REF!"}}]
[null,"","","","",null,null,null,"","",""]
[null,"","2.","Other Operating Costs:",null,null,null,null,"","",""]
[null,"","","2.01","Weanling Cost **",null,null,null,{"$f":"J16*'Farrow Input'!F83","v":{"$error":"#REF!"}},{"$f":"#REF!*'Farrow Input'!F79/'Farrow Input'!F83","v":{"$error":"#REF!"}},{"$f":"J16*'Farrow Input'!F83/'Farrow Input'!I74","v":{"$error":"#REF!"}}]
[null,"","","2.02","Veterinary Cost",null,null,null,{"$f":"J17*'Farrow Input'!F83","v":0},{"$f":"ROUND('Farrow Input'!C120*'Farrow Input'!F64/'Farrow Input'!F83,2)","v":0},{"$f":"J17*'Farrow Input'!F83/'Farrow Input'!I74","v":0}]
[null,"","","2.03","Maintenance & Repairs",null,null,null,{"$f":"J18*'Farrow Input'!F83","v":{"$error":"#REF!"}},{"$f":"ROUND(#REF!*#REF!/'Farrow Input'!F83/100,2)","v":{"$error":"#REF!"}},{"$f":"J18*'Farrow Input'!F83/'Farrow Input'!I74","v":{"$error":"#REF!"}}]
[null,"","","B7","Hydro (Heat)",null,null,null,{"$f":"J19*'Farrow Input'!F83","v":{"$error":"#REF!"}},{"$f":"ROUND(#REF!*#REF!*'Farrow Input'!I74/'Farrow Input'!F83,2)","v":{"$error":"#REF!"}},{"$f":"J19*'Farrow Input'!F83/'Farrow Input'!I74","v":{"$error":"#REF!"}}]
[null,"","","2.05","Insurance",null,null,null,{"$f":"J20*'Farrow Input'!F83","v":{"$error":"#REF!"}},{"$f":"#REF!","v":{"$error":"#REF!"}},{"$f":"J20*'Farrow Input'!F83/'Farrow Input'!I74","v":{"$error":"#REF!"}}]
{"$rows_left_out":41}
{"sheet":"Weaner-O","index":8,"n_rows":63,"n_cols":10,"rows_kept":63,"cut":false,"hidden":true,"merged":[]}
[]
[]
[null,"============================================================================="]
[null,"","WEANER PIG PRODUCTION COST SUMMARY",null,null,null,null,null,"",""]
[null,"","","","","","","","",""]
[null,"============================================================================="]
[null,"A.","OPERATING COSTS",null,null,null,null,"     TOTAL","$/HOG SOLD","$/SOW/YR"]
[null,"","1.","Feed Costs:",null,"","","------------------------------------------------------------------------"]
[null,"","","A1","Sow Lactation Ration",null,null,{"$f":"ROUND('Farrow Input'!G16*'Farrow Input'!F24*'Farrow Input'!G51*'Farrow Input'!#REF!/1000*'Farrow Input'!G13,2)","v":{"$error":"#REF!"}},{"$f":"ROUND(J9/'Farrow Input'!$G$83,2)","v":{"$error":"#REF!"}},{"$f":"ROUND('Farrow Input'!G16*'Farrow Input'!F24*'Farrow Input'!G51*'Farrow Input'!#REF!/1000,2)","v":{"$error":"#REF!"}}]
[null,"","","1.02","Sow Gestation Ration",null,null,{"$f":"ROUND((365-'Farrow Input'!G16*'Farrow Input'!F24)*'Farrow Input'!F51*'Farrow Input'!#REF!/1000*'Farrow Input'!G13,2)","v":{"$error":"#REF!"}},{"$f":"ROUND(J10/'Farrow Input'!$G$83,2)","v":{"$error":"#REF!"}},{"$f":"ROUND((365-'Farrow Input'!G16*'Farrow Input'!F24)*'Farrow Input'!F51*'Farrow Input'!#REF!/1000,2)","v":{"$error":"#REF!"}}]
[null,"","","1.03","Boar Ration",null,null,{"$f":"ROUND(365*'Farrow Input'!H51*'Farrow Input'!#REF!/1000*'Farrow Input'!E23/'Farrow Input'!E22*'Farrow Input'!G13,2)","v":{"$error":"#REF!"}},{"$f":"ROUND(J11/'Farrow Input'!$G$83,2)","v":{"$error":"#REF!"}},{"$f":"ROUND(365*'Farrow Input'!H51*'Farrow Input'!#REF!/1000*'Farrow Input'!E23/'Farrow Input'!E22,2)","v":{"$error":"#REF!"}}]
[null,"","","1.04","Creep Feed",null,null,{"$f":"ROUND('Farrow Input'!E37*'Farrow Input'!#REF!/1000*'Farrow Input'!F25*'Farrow Input'!G13,2)","v":{"$error":"#REF!"}},{"$f":"ROUND(J12/'Farrow Input'!$G$83,2)","v":{"$error":"#REF!"}},{"$f":"ROUND('Farrow Input'!E37*'Farrow Input'!#REF!/1000*'Farrow Input'!F25,2)","v":{"$error":"#REF!"}}]
[null,"","","1.05","Starter Ration #1",null,null,{"$f":"ROUND('Farrow Input'!F37*'Farrow Input'!#REF!/1000*'Farrow Input'!F29*'Farrow Input'!G13,2)","v":{"$error":"#REF!"}},{"$f":"ROUND(J13/'Farrow Input'!$G$83,2)","v":{"$error":"#REF!"}},{"$f":"ROUND('Farrow Input'!F37*'Farrow Input'!#REF!/1000*'Farrow Input'!F29,2)","v":{"$error":"#REF!"}}]
[null,null,null,"1.05","Starter Ration #2",null,null,{"$f":"ROUND('Farrow Input'!G37*'Farrow Input'!#REF!/1000*'Farrow Input'!F29*'Farrow Input'!G13,2)","v":{"$error":"#REF!"}},{"$f":"ROUND(J14/'Farrow Input'!$G$83,2)","v":{"$error":"#REF!"}},{"$f":"ROUND('Farrow Input'!G37*'Farrow Input'!#REF!/1000*'Farrow Input'!F29,2)","v":{"$error":"#REF!"}}]
[null,"","","","","","","===================================="]
[null,"","","Total Feed Cost",null,null,null,{"$f":"J16*'Farrow Input'!E22","v":{"$error":"#REF!"}},{"$f":"ROUND(J16/'Farrow Input'!$G$83,2)","v":{"$error":"#REF!"}},{"$f":"SUM(J8:J15)","v":{"$error":"#REF!"}}]
[null,"","","","",null,null,"","",""]
[null,"","2.","Other Operating Costs:",null,null,null,"","",""]
[null,"","","A7","Vet. Medicine & Supplies:",null,null,"","",""]
[null,"","","","    Professional Services",null,null,{"$f":"J20*'Farrow Input'!E22","v":70000},{"$f":"ROUND(J20/'Farrow Input'!$G$83,2)","v":5.37},{"$f":"ROUND('Farrow Input'!C115,2)","v":140}]
{"$rows_left_out":43}