{"text_format":"1","workbook":"xlsx","n_sheets":7,"sheets":["Introduction","Assumptions","Farrow-Wean Summary","Risk Analysis","Farrow-Wean Input","Fixed Cost","Ingredient-Summary"],"not_rendered":{"charts":0,"images":3,"macros":1,"external_links":0,"defined_names":44,"comments":1,"pivot_tables":0},"unopened":[],"bounds":{"document_bytes":16777216,"sheet_cells":100000,"rows_first":2000,"rows_last":500,"rows_between":2000,"halvings":0,"cell_chars":16384,"cell_head_chars":4096},"cells_cut":0,"cells_raw":0,"read":"whole","date_system":"1900"}

{"sheet":"Introduction","index":0,"n_rows":47,"n_cols":8,"rows_kept":47,"cut":false,"hidden":false,"merged":[[46,1,48,8],[4,1,4,8],[5,1,5,8],[6,1,6,8],[50,1,51,8],[11,1,20,8],[21,1,32,8]]}
[]
[]
[". . . . . . . . . . . . . . . . . . . . . . . . . . . . . . . . . . . . . . . . . . . . . . . . . "]
[]
[null,"Guidelines For Estimating"]
[null,"Swine Farrow-Wean to 6 kg Costs"]
[null,{"$f":"\"Based On \"&'Farrow-Wean Input'!G11&\" Sows \"&FIXED('Farrow-Wean Input'!F27,0)&\" Pigs Sold\"","v":"Based On 600 Sows 16,944 Pigs Sold"}]
[]
[null,null,null,null,null,null,"Date:","June, 2025"]
[]
[]
[null,"This guide is designed to provide you with planning information and a format for calculating costs of production of a swine farrow to 6kg enterprise  in Manitoba.  This operation is intended to represent the first stage of a three stage system.  General Manitoba Agriculture recommendations are assumed in using feed and veterinary inputs. These figures provide an economic evaluation of the livestock and estimated prices required to cover all costs.  Costs include labour, investment and depreciation, but do not include management costs, nor do they necessarily represent the average cost of production in Manitoba."]
[]
[]
[]
[]
[]
[]
[]
[]
[]
[null,"These budgets may be adjusted by putting in your own figures.  As a producer you are encouraged to calculate your own costs of production. The assumptions on which the costs are based are outlined in the supporting pages. These assumptions were arrived at using the breeding stock, management practices, and facilities seen in modern, well managed swine operations of comparable size in Manitoba. Productivity and performance assumptions are based on information collected by department specialists, feed companies and other organizations. Where individual herd productivity and performance levels differ from those listed, adjustments will be required. "]
[]
[]
[]
[]
[]
[]
[]
[]
[]
[]
[]
[null,"This tool is available as an Excel worksheet at: "]
[]
[]
[]
[]
[]
[null,"                                                                                          is also available to help"]
{"$rows_left_out":8}
{"sheet":"Assumptions","index":1,"n_rows":17,"n_cols":2,"rows_kept":17,"cut":false,"hidden":false,"merged":[[12,1,14,8],[16,1,22,8],[4,1,5,8],[7,1,10,8],[1,1,1,8]]}
[]
[null,"Farrow-Wean to 6 kg Pig Cost of Production"]
[]
[]
[null,"The following farrow wean to 6 kg cost of production budget is based on the assumption that all feed is purchased."]
[]
[]
[null,{"$f":"\"The budget includes a land investment cost for \"&'Fixed Cost'!D31&\" acres, with \"&'Fixed Cost'!C44&\" acres rented out at $\"&'Fixed Cost'!C45&\" per acre, of the estimated \"&ROUND(((('Farrow-Wean Input'!C94*'Farrow-Wean Input'!H96)/(40.768*2))*2.4709661),0)&\" to \"&ROUND(((('Farrow-Wean Input'!C94*'Farrow-Wean Input'!H96)/(26.362*2))*2.4709661),0)&\" acres of total landbase that would be required for this size of livestock operation. This land base falls within the 2XP2O5 application rate, soil phosphorus levels permitting.\"","v":"The budget includes a land investment cost for 40 acres, with 0 acres rented out at $100 per acre, of the estimated 84 to 130 acres of total landbase that would be required for this size of livestock operation. This land base falls within the 2XP2O5 application rate, soil phosphorus levels permitting."}]
[]
[]
[]
[]
[null,"The rations illustrated in this budget are examples only. Individual farm conditions should be taken into account when formulating the diets. Producers need to know what the feed intakes of their animals are. Please consult with a nutritionist for diet formulation suggestions."]
[]
[]
[]
[null,"The Manitoba pork production industry profile is changing and this budget was specifically designed to address the need of producers who may want to analyze the cost of starting up or switching to a farrow wean 6 kg operation. Several companies are offering contracts with varying levels of guarantees. Producers need to accurately calculate their costs before they can properly make a decision."]

{"sheet":"Farrow-Wean Summary","index":2,"n_rows":61,"n_cols":9,"rows_kept":61,"cut":false,"hidden":false,"merged":[[60,0,61,8],[2,4,2,6],[0,0,0,8],[39,0,39,8]]}
[{"$f":"'Farrow-Wean Input'!G11&\" Sow Farrow-Wean to 6kg Cost of Production Summary - \"&Introduction!H9","v":"600 Sow Farrow-Wean to 6kg Cost of Production Summary - June, 2025"}]
[]
[null,null,null,null,"Purchased Feed"]
[null,null,null,null,"$/Pig",null,"Total"]
["A. Operating Costs",null,null,null,"Sold","$/Sow","Cost",null,"Your Cost"]
["1.","Feed Costs:"]
[null,"Sow Lactation Ration",null,null,{"$f":"'Farrow-Wean Input'!G40","v":5.5103657932011334},{"$f":"ROUND(E7*'Farrow-Wean Input'!$G$27,2)","v":155.61000000000001},{"$f":"ROUND(E7*'Farrow-Wean Input'!$F$27,0)","v":93368}]
[null,"Sow Gestation Ration",null,null,{"$f":"'Farrow-Wean Input'!F40","v":14.021959631728045},{"$f":"ROUND(E8*'Farrow-Wean Input'!$G$27,2)","v":395.98},{"$f":"ROUND(E8*'Farrow-Wean Input'!$F$27,0)","v":237588}]
[null,"Boar Ration",null,null,{"$f":"'Farrow-Wean Input'!H40","v":8.1233179886685547E-2},{"$f":"ROUND(E9*'Farrow-Wean Input'!$G$27,2)","v":2.29},{"$f":"ROUND(E9*'Farrow-Wean Input'!$F$27,0)","v":1376}]
[null,"Creep Feed",null,null,{"$f":"'Farrow-Wean Input'!I40","v":0.87971246458923524},{"$f":"ROUND(E10*'Farrow-Wean Input'!$G$27,2)","v":24.84},{"$f":"ROUND(E10*'Farrow-Wean Input'!$F$27,0)","v":14906}]
["Total Feed Cost",null,null,null,{"$f":"SUM(E7:E10)","v":20.493271069405097},{"$f":"SUM(F7:F10)","v":578.72},{"$f":"SUM(G7:G10)","v":347238}]
[]
["2.","Other Operating Costs:",null,null,null,""]
[null,"Veterinary Medicine & Supplies:",null,null,{"$f":"'Farrow-Wean Input'!C54","v":4.9575070821529748},{"$f":"ROUND(E14*'Farrow-Wean Input'!$G$27,2)","v":140},{"$f":"ROUND(E14*'Farrow-Wean Input'!$F$27,0)","v":84000}]
[null,"Maintenance & Repairs",null,null,{"$f":"'Farrow-Wean Input'!C60","v":1.9837095249006116},{"$f":"ROUND(E15*'Farrow-Wean Input'!$G$27,2)","v":56.02},{"$f":"ROUND(E15*'Farrow-Wean Input'!$F$27,0)","v":33612}]
[null,"Hydro & Propane",null,null,{"$f":"'Farrow-Wean Input'!C73+'Farrow-Wean Input'!C67","v":3.7288597733711049},{"$f":"ROUND(E16*'Farrow-Wean Input'!$G$27,2)","v":105.3},{"$f":"ROUND(E16*'Farrow-Wean Input'!$F$27,0)","v":63182}]
[null,"Insurance",null,null,{"$f":"'Farrow-Wean Input'!I80","v":2.0155323523817463},{"$f":"ROUND(E17*'Farrow-Wean Input'!$G$27,2)","v":56.92},{"$f":"ROUND(E17*'Farrow-Wean Input'!$F$27,0)","v":34151}]
[null,"Manure Costs",null,null,{"$f":"'Farrow-Wean Input'!C109","v":0.90704247120977788},{"$f":"ROUND(E18*'Farrow-Wean Input'!$G$27,2)","v":25.61},{"$f":"ROUND(E18*'Farrow-Wean Input'!$F$27,0)","v":15369}]
[null,"Office Supplies",null,null,{"$f":"'Farrow-Wean Input'!C114","v":7.0821529745042494E-2},{"$f":"ROUND(E19*'Farrow-Wean Input'!$G$27,2)","v":2},{"$f":"ROUND(E19*'Farrow-Wean Input'!$F$27,0)","v":1200}]
[null,"Marketing & Transport.",null,null,{"$f":"'Farrow-Wean Input'!C119","v":3.69},{"$f":"ROUND(E20*'Farrow-Wean Input'!$G$27,2)","v":104.21},{"$f":"ROUND(E20*'Farrow-Wean Input'!$F$27,0)","v":62523}]
[null,"Herd Replacement",null,null,{"$f":"'Farrow-Wean Input'!C154","v":2.6469810154036835},{"$f":"ROUND(E21*'Farrow-Wean Input'!$G$27,2)","v":74.75},{"$f":"ROUND(E21*'Farrow-Wean Input'!$F$27,0)","v":44850}]
[null,"Artificial Insemination",null,null,{"$f":"'Farrow-Wean Input'!C127","v":2.039518413597734},{"$f":"ROUND(E22*'Farrow-Wean Input'!$G$27,2)","v":57.6},{"$f":"ROUND(E22*'Farrow-Wean Input'!$F$27,0)","v":34558}]
[null,"Property Tax",null,null,{"$f":"'Farrow-Wean Input'!C166","v":0.47804532577903686},{"$f":"ROUND(E23*'Farrow-Wean Input'!$G$27,2)","v":13.5},{"$f":"ROUND(E23*'Farrow-Wean Input'!$F$27,0)","v":8100}]
["Subtotal Operating Costs",null,null,null,{"$f":"SUM(E14:E23)+E11","v":43.011288557946813},{"$f":"SUM(F14:F23)+F11","v":1214.6300000000001},{"$f":"SUM(G14:G23)+G11","v":728783}]
[null,"Interest on Operating Costs",null,null,{"$f":"'Farrow-Wean Input'!C174","v":0.63251894938157083},{"$f":"ROUND(E25*'Farrow-Wean Input'!$G$27,2)","v":17.86},{"$f":"ROUND(E25*'Farrow-Wean Input'!$F$27,0)","v":10717}]
["Total Operating Costs",null,null,null,{"$f":"SUM(E24:E25)","v":43.643807507328383},{"$f":"SUM(F24:F25)","v":1232.49},{"$f":"SUM(G24:G25)","v":739500}]
[]
["B. Fixed Costs",null,null,null,null,""]
[null,"Buildings & Manure Storage",null,null,{"$f":"'Fixed Cost'!D27","v":8.7875337791543249},{"$f":"ROUND(E29*'Farrow-Wean Input'!$G$27,2)","v":248.16},{"$f":"ROUND(E29*'Farrow-Wean Input'!$F$27,0)","v":148896}]
[null,"Barn Equipment",null,null,{"$f":"'Fixed Cost'!I27","v":7.8812497781731388},{"$f":"ROUND(E30*'Farrow-Wean Input'!$G$27,2)","v":222.57},{"$f":"ROUND(E30*'Farrow-Wean Input'!$F$27,0)","v":133540}]
[null,"Breeding Stock",null,null,{"$f":"'Fixed Cost'!I39+'Fixed Cost'!I51","v":2.0821680793829538},{"$f":"ROUND(E31*'Farrow-Wean Input'!$G$27,2)","v":58.8},{"$f":"ROUND(E31*'Farrow-Wean Input'!$F$27,0)","v":35280}]
[null,"Land",null,null,{"$f":"'Fixed Cost'!D41","v":0.79975978963628203},{"$f":"ROUND(E32*'Farrow-Wean Input'!$G$27,2)","v":22.59},{"$f":"ROUND(E32*'Farrow-Wean Input'!$F$27,0)","v":13551}]
["Total Fixed Costs",null,null,null,{"$f":"SUM(E29:E32)","v":19.550711426346702},{"$f":"SUM(F29:F32)","v":552.12},331267]
[]
["C. Labour",null,null,null,null,""]
[null,"Wages, benefits and hired manager",null,null,{"$f":"'Farrow-Wean Input'!C48","v":9.9433427762039663},{"$f":"ROUND(E36*'Farrow-Wean Input'!$G$27,2)","v":280.8},{"$f":"ROUND(E36*'Farrow-Wean Input'!$F$27,0)","v":168480}]
[]
["Total Cost of Production",null,null,null,{"$f":"E26+E33+E36","v":73.137861709879047},{"$f":"F26+F33+F36","v":2065.4100000000003},{"$f":"G26+G33+G36","v":1239247}]
[]
["Profitability and Breakeven Analysis"]
{"$rows_left_out":22}
{"sheet":"Risk Analysis","index":3,"n_rows":53,"n_cols":5,"rows_kept":53,"cut":false,"hidden":false,"merged":[[0,0,0,7],[52,0,54,7]]}
["Risk & Sensitivity Analysis"]
[]
[null,null,"Purchased Feed"]
[null,null,"Per Pig"]
["A.  Operating Costs"]
[null,"Feed cost",{"$f":"'Farrow-Wean Summary'!E11","v":20.493271069405097}]
[null,"Other Operating Costs",{"$f":"SUM('Farrow-Wean Summary'!E26-'Farrow-Wean Summary'!E11)","v":23.150536437923286}]
[null,"Subtotal",{"$f":"SUM(C6:C7)","v":43.643807507328383}]
["B.  Fixed Costs",null,{"$f":"'Farrow-Wean Summary'!E33","v":19.550711426346702}]
["C.  Labour",null,{"$f":"'Farrow-Wean Summary'!E36","v":9.9433427762039663}]
["Total Costs",null,{"$f":"SUM(C8:C10)","v":73.137861709879047}]
[]
["Estimated Farmgate"]
[null,"Price ($ per weanling)",{"$f":"'Farrow-Wean Summary'!E43","v":63}]
[null,"Weanlings sold per sow",{"$f":"'Farrow-Wean Input'!G27","v":28.24}]
[]
[]
[null,null,"Up",null,"Down"]
[null,"Percent Market Price Variation",0.1,null,0.1]
[null,"Percent Feed Cost Variation",0.1,null,0.05]
[null,"Weanlings Sold Per Sow ",0.5,null,2.5]
[]
[]
[null,"Higher Price ($ per weanling)",{"$f":"SUM(C14*(1+C19))","v":69.300000000000011}]
[null,"Lower Price ($ per weanling)",{"$f":"SUM(C14*(1-E19))","v":56.7}]
[null,"Higher Feed Cost",{"$f":"SUM(C6+(C6*(C20)))","v":22.542598176345606}]
[null,"Lower Feed Cost",{"$f":"SUM(C6-(C6*E20))","v":19.468607515934842}]
[null,"Higher Weanlings Sold Per Sow",{"$f":"SUM(C15+C21)","v":28.74}]
[null,"Lower Weanlings Sold Per Sow",{"$f":"SUM(C15-E21)","v":25.74}]
[]
[]
[{"$f":"\"Higher Margin Scenario - Price Up \"&C19*100&\"%, Feed Price Down \"&E20*100&\"% and Weanlings Sold Per Sow Up \"&C21","v":"Higher Margin Scenario - Price Up 10%, Feed Price Down 5% and Weanlings Sold Per Sow Up 0.5"}]
[null,"Operating Costs",{"$f":"SUM(C7+((C27*'Farrow-Wean Input'!$G$27)/C28))","v":42.280441665828647}]
[null,"Total Costs",{"$f":"C33+C10+C9","v":71.774495868379319}]
[null,"Gross Revenue / hog",{"$f":"SUM(C24+'Farrow-Wean Summary'!$E$44)","v":69.300000000000011}]
[null,"Marginal Returns "]
[null,"   Over Operating Costs",{"$f":"SUM(C35-C33)","v":27.019558334171364}]
[null,"   Over Operating & Labour Costs",{"$f":"SUM(C35-C33-C10)","v":17.076215557967398}]
[null,"   Over Total Costs (Net Profit)",{"$f":"SUM(C35-C34)","v":-2.4744958683793072}]
[null,"Operating Expense Ratio",{"$f":"SUM(C33/C35)","v":0.61010738334529058}]
{"$rows_left_out":14}
{"sheet":"Farrow-Wean Input","index":4,"n_rows":179,"n_cols":9,"rows_kept":179,"cut":false,"hidden":false,"merged":[[0,0,0,10]]}
["Farrow to 6kg Pig Production Costs"]
[]
["1."," This input table outlines the production assumptions used."]
["2."," Buildings and equipment are valued at new cost."]
["3."," Manure haulage is contracted out."]
["4."," Gilts are purchased for herd replacement."]
[]
[null,null,"Weanling market price / head",null,null,63]
[]
["Indicators of Productivity"]
["Sows",null,null,null,null,null,600,300,"/sow"]
["Boars",null,null,null,null,null,3,3000," /boar"]
["Litters/Sow/Year",null,null,null,null,null,2.38]
["Average Weaning Age (days)",null,null,null,null,null,21]
["Average Born Alive per Litter",null,null,null,null,null,13.9]
["Percent Pre-Weaning Mortality",null,null,null,null,null,12.5]
["Percent Post-Weaning Culls",null,null,null,null,null,2.44]
[]
["Herd Profile",null,null,null,null,"Total","/Sow","/Litter","%Mortality"]
["Sows",null,null,null,null,{"$f":"G11","v":600}]
["Boars",null,null,null,null,{"$f":"G12","v":3}]
["Litters",null,null,null,null,{"$f":"ROUND(G22*F20,0)","v":1428},{"$f":"G13","v":2.38},"",""]
["Pigs Born Alive",null,null,null,null,{"$f":"ROUND(G15*F22,0)","v":19849},{"$f":"ROUND(F23/F20,2)","v":33.08},{"$f":"G15","v":13.9},""]
["Pigs Died, Pre-Weaning",null,null,null,null,{"$f":"ROUND(G16*F23/100,0)","v":2481},{"$f":"ROUND(F24/F20,2)","v":4.1399999999999997},{"$f":"ROUND(F24/F22,2)","v":1.74},{"$f":"G16","v":12.5}]
["Pigs Weaned",null,null,null,null,{"$f":"F23-F24","v":17368},{"$f":"ROUND(F25/F20,2)","v":28.95},{"$f":"ROUND(F25/F22,2)","v":12.16},""]
["Pigs Culled ",null,null,null,null,{"$f":"ROUND(G17*F25/100,0)","v":424},{"$f":"ROUND(F26/F20,2)","v":0.71},{"$f":"ROUND(F26/F22,2)","v":0.3},{"$f":"G17","v":2.44}]
["Weaner Pigs Sold",null,null,null,null,{"$f":"ROUND(F25-F26,0)","v":16944},{"$f":"ROUND(F27/F20,2)","v":28.24},{"$f":"ROUND(F27/F22,2)","v":11.87},""]
[]
["Feed Requirements and Costs",null,null,null,null,null,"Nursing"]
[null,null,null,null,null,"Dry Sow","Sow","Boar Ration","Creep Feed"]
[null,null,"Days average weaning age",null,null,null,{"$f":"G14","v":21},null," (kg/pig)"]
[null,"x","Litters/Sow/Year",null,null,null,{"$f":"G13","v":2.38}]
[null,"=","Days lactation/gestation",null,null,{"$f":"365-G33","v":315.02},{"$f":"SUM(G14*G13)","v":49.98},365]
[null,"x","kg ration/day",null,null,3,6.5,3,0.5]
[null,"x","ration cost per tonne",null,null,419,479,419,1502]
[null,"x","boars",null,null,null,null,{"$f":"G12","v":3}]
[null,"÷","kg/tonne",null,null,1000,1000,1000]
[null,"x","pigs born alive/sow/year",null,null,null,null,null,{"$f":"G23","v":33.08}]
[null,"÷","pigs sold/sow/year",null,null,{"$f":"G27","v":28.24},{"$f":"G27","v":28.24},{"$f":"F27","v":16944},{"$f":"G27","v":28.24}]
[null,"=","/pig sold",null,null,{"$f":"(F33*F34*F35/F37)/F39","v":14.021959631728045},{"$f":"(G31*G32*G34*G35/1000)/G39","v":5.5103657932011334},{"$f":"(H33*H34*H35*H36/H37)/H39","v":8.1233179886685547E-2},{"$f":"((I34*I35/1000)*I38)/I39","v":0.87971246458923524}]
{"$rows_left_out":140}
{"sheet":"Fixed Cost","index":5,"n_rows":68,"n_cols":12,"rows_kept":68,"cut":false,"hidden":false,"merged":[[0,0,0,9],[53,0,54,9]]}
["Fixed Costs"]
[]
[null,"Pig Places1"]
[null,"Gestation",{"$f":"'Farrow-Wean Input'!G11","v":600},27,"ft.2 per Pig Place",null,{"$f":"D4*C4","v":16200},"ft.2 Total"]
[null,"Farrowing",{"$f":"'Farrow-Wean Input'!F25/'Farrow-Wean Input'!G13","v":7297.4789915966394},1.07,"ft.2 per Pig Place",null,7808.3025210084043,"ft.2 Total"]
[]
[]
["Buildings",null,"$/pig place","Total",null,"Barn Equipment",null,"$/pig place","Total"]
[null,"  Gestation",1750,{"$f":"C9*$C$4","v":1050000},{"$f":"\"($\"&ROUND((C9*$C$4)/$G$4,0)&\"/sq.ft.) \"","v":"($65/sq.ft.) "},null,"Gestation",720,{"$f":"H9*$C$4","v":432000},{"$f":"\"($\"&ROUND((H9*$C$4)/$G$4,0)&\"/sq.ft.) \"","v":"($27/sq.ft.) "}]
[null,"  Farrowing",50,{"$f":"C10*$C$5","v":364873.94957983197},{"$f":"\"($\"&ROUND((C10*$C$5)/$G$5,0)&\"/sq.ft.) \"","v":"($47/sq.ft.) "},null,"Farrowing",30,{"$f":"H10*$C$5","v":218924.36974789918},{"$f":"\"($\"&ROUND((H10*$C$5)/$G$5,0)&\"/sq.ft.) \"","v":"($28/sq.ft.) "}]
[null,"  Office and Loading (300 sq.ft.)",25,{"$f":"C11*$C$4","v":15000},{"$f":"\"($\"&ROUND((C11*$C$4)/300,0)&\"/sq.ft.) \"","v":"($50/sq.ft.) "},null,"Other",0,{"$f":"H11*C4","v":0},null,null,"*HIDE*"]
[null,"  Manure Storage",200,{"$f":"C12*$C$4","v":120000},null,null,"Fire Alarm System",5,{"$f":"H12*$C$4","v":3000},null,null,{"$f":"(#REF!-#REF!)/(#REF!+#REF!)","v":{"$error":"#REF!"}}]
[null,"  Standby Generator",41.666600000000003,{"$f":"C13*$C$4","v":24999.960000000003},null,null,"Storage Bins",20,{"$f":"H13*C4","v":12000}]
[null,"Total Barn Cost",null,{"$f":"SUM(D9:D13)","v":1574873.9095798319},null,null,"Total Equipment Cost",null,{"$f":"SUM(I9:I13)","v":665924.36974789924}]
[]
[null,"  Residual Value (End of Useful Life)",null,0.5,null,null,"  Residual Value (End of Useful Life)",null,0.1]
[null,"  Useful Life (years)",null,25,null,null,"  Useful Life (years)",null,10]
[null,"  Owned Barn Equity",null,0.25,null,null,"  Owned Barn Equipment Equity",null,0.25]
[null,"  Barn Financed",null,{"$f":"SUM(1-D18)","v":0.75},null,null,"  Barn Equipment Financed",null,{"$f":"SUM(1-I18)","v":0.75}]
[null,"  Barn Opportunity Cost (Investment Rate) ",null,1.4999999999999999E-2,null,null,"  Equipment Opportunity Cost (Investment Rate) ",null,1.4999999999999999E-2]
[null,"Buildings Cost",null,null,null,null,"Barn Equipment Cost"]
[null,"  Finance Rate & Term",7.0000000000000007E-2,20,"Years",null,"  Finance Rate & Term",7.0000000000000007E-2,10,"Years"]
[null,"  Principle & Interest Cost",null,{"$f":"-PMT(C22,D22,D14*D19,0)","v":111492.71700146988},null,null,"  Principle & Interest Cost",null,{"$f":"-PMT(H22,I22,I14*I19,0)","v":71109.486577500124}]
[null,"  Buildings Depreciation Cost",null,{"$f":"(D14-(D14*D16))/D17","v":31497.478191596638},null,null,"  Equipment Depreciation Cost",null,{"$f":"(I14-(I14*I16))/I17","v":59933.193277310929}]
[null,"  Owned Building Opportunity Cost ",null,{"$f":"SUM(D14*D18)*(D20)","v":5905.7771609243691},null,null,"  Owned Equipment Opportunity Cost ",null,{"$f":"SUM(I14*I18)*(I20)","v":2497.2163865546222}]
[null,"  Total Cost",null,{"$f":"SUM(D23:D25)","v":148895.97235399089},null,null,"  Total Cost",null,{"$f":"SUM(I23:I25)","v":133539.89624136567}]
[null,{"$f":"\"  Total Cost $/pig sold (based on \"&TEXT('Farrow-Wean Input'!F27,\"#,###\")&\")\"","v":"  Total Cost $/pig sold (based on 16,944)"},null,{"$f":"D26/'Farrow-Wean Input'!F27","v":8.7875337791543249},null,null,{"$f":"\"  Total Cost $/pig sold (based on \"&TEXT('Farrow-Wean Input'!F27,\"#,###\")&\")\"","v":"  Total Cost $/pig sold (based on 16,944)"},null,{"$f":"I26/'Farrow-Wean Input'!F27","v":7.8812497781731388}]
[null,null,null,null,null,null,null,null,null,null,null,"w/o harvest"]
["Land",null,null,null,null,"Breeding Stock - Sows",null,null,null,null,null,{"$f":"-PMT($C$22,$D$22,L12*$D$19,0)","v":{"$error":"#REF!"}}]
[null,"  Average Land value ($/acre)",null,4000,null,null,"  Sow value ($/head)",null,{"$f":"'Farrow-Wean Input'!H11","v":300}]
[null,"  Acres",null,40,null,null,"  Owned Sow Equity",null,0.25]
[null,"  Site preparation cost",null,36000,null,null,{"$f":"\"  Sows Financed (\"&TEXT(I30*I32,\"$#,###\")&\" per head)\"","v":"  Sows Financed ($225 per head)"},null,{"$f":"SUM(1-I31)","v":0.75},null,null,{"$f":"(L12-(L12*$D$16))/$D$17","v":{"$error":"#REF!"}}]
[null,"  Owned Land Equity",null,0.25,null,null,"  Cow Opportunity Cost (Investment Rate) ",null,1.4999999999999999E-2]
[null,"  Land Financed",null,{"$f":"SUM(1-D33)","v":0.75},null,null,"Sow cost"]
[null,"  Land Opportunity Cost (Investment Rate) ",null,1.4999999999999999E-2,null,null,"  Finance Rate & Term",7.0000000000000007E-2,5,"Years"]
[null,"Land cost ",null,null,null,null,"  Principle & Interest Cost",null,{"$f":"-PMT(H35,I35,I30*'Farrow-Wean Input'!G11*I32,0)","v":32925.243749585497}]
[null,"  Finance Rate & Term",0.06,20,"Years",null,"  Owned Sows Opportunity Cost",null,{"$f":"SUM(I30*'Farrow-Wean Input'!G11*I31)*(I33)","v":675}]
[null,"  Principle & Interest Cost",null,{"$f":"-PMT(C37,D37,((D30*D31)+D32)*D34,0)","v":12816.129875597162},{"$f":"-IPMT(C37,D37,((D30*D31)+D32)*D34,0)","v":0},null,"  Total Cost",null,{"$f":"SUM(I36:I37)","v":33600.243749585497}]
[null,"  Owned Land Opportunity Cost",null,{"$f":"SUM(((D30*D31)+D32)*D33)*(D35)","v":735},null,null,{"$f":"\"  Total Cost $/pig sold (based on \"&TEXT('Farrow-Wean Input'!F27,\"#,###\")&\")\"","v":"  Total Cost $/pig sold (based on 16,944)"},null,{"$f":"I38/'Farrow-Wean Input'!F27","v":1.9830172184599562}]
[null,"  Total Cost",null,{"$f":"SUM(D38:D39)","v":13551.129875597162}]
{"$rows_left_out":29}
{"sheet":"Ingredient-Summary","index":6,"n_rows":14,"n_cols":7,"rows_kept":14,"cut":false,"hidden":false,"merged":[[1,2,1,6]]}
[]
[null,null,"  Summary of Purchased Feeds Used"]
[]
[null,"Number of Sows",null,{"$f":"'Farrow-Wean Input'!$G$11","v":600}]
[null,"Total Pigs Fed",null,{"$f":"'Farrow-Wean Input'!$F$25","v":17368}]
[]
[null,null,null,"Total","Total","Total","Total"]
[null,null,null,"per Year","per Month","per Pig","per Pig"]
[null,null,null,"(tonnes)","(tonnes)","(kgs)","(lbs)"]
[null,"Dry Sow",null,{"$f":"IF('Farrow-Wean Input'!F35<=0,0,('Farrow-Wean Input'!F34*'Farrow-Wean Input'!F33)*'Farrow-Wean Input'!F20/1000)","v":567.03599999999994},{"$f":"D10/12","v":47.252999999999993},{"$f":"(D10/$D$5)*1000","v":32.648318747121138},{"$f":"F10*2.2046","v":71.976483509903261}]
[null,"Lactating Sow",null,{"$f":"IF('Farrow-Wean Input'!G35<=0,0,('Farrow-Wean Input'!G34*'Farrow-Wean Input'!G33)*'Farrow-Wean Input'!F20/1000)","v":194.922},{"$f":"D11/12","v":16.243500000000001},{"$f":"(D11/$D$5)*1000","v":11.223053892215569},{"$f":"F11*2.2046","v":24.742344610778446}]
[null,"Boar",null,{"$f":"IF('Farrow-Wean Input'!H35<=0,0,('Farrow-Wean Input'!H34*'Farrow-Wean Input'!H33)*'Farrow-Wean Input'!F21/1000)","v":3.2850000000000001},{"$f":"D12/12","v":0.27374999999999999},{"$f":"(D12/$D$5)*1000","v":0.1891409488714878},{"$f":"F12*2.2046","v":0.41698013588208205}]
[null,"Creep",null,{"$f":"IF('Farrow-Wean Input'!I35<=0,0,('Farrow-Wean Input'!I34*'Farrow-Wean Input'!F25)/1000)","v":8.6839999999999993},{"$f":"D13/12","v":0.72366666666666657},{"$f":"(D13/$D$5)*1000","v":0.5},{"$f":"F13*2.2046","v":1.1023000000000001}]
[null,"Total",null,{"$f":"SUM(D10:D13)","v":773.92699999999991},{"$f":"SUM(E10:E13)","v":64.493916666666664},{"$f":"SUM(F10:F13)","v":44.560513588208195},{"$f":"SUM(G10:G13)","v":98.238108256563791}]